{"text_format":"1","workbook":"xlsx","n_sheets":10,"sheets":["Div legend","Saturday","Sunday 3-Lift","Sunday Deadlift","Sunday Bench","Age Factors","mwf","wwf","Classes","Module1"],"not_rendered":{"charts":0,"images":0,"macros":1,"external_links":0,"defined_names":11,"comments":0,"pivot_tables":0},"unopened":[],"bounds":{"document_bytes":16777216,"sheet_cells":100000,"rows_first":2000,"rows_last":500,"rows_between":2000,"halvings":0,"cell_chars":16384,"cell_head_chars":4096},"cells_cut":0,"cells_raw":0,"read":"whole","date_system":"1900"}

{"sheet":"Div legend","index":0,"n_rows":36,"n_cols":2,"rows_kept":36,"cut":false,"hidden":false,"merged":[[0,0,1,1]]}
["Divisions"]
[]
["Abbrev","Description"]
["M-Nov","Men's Novice"]
["M-T2ST","T(16-17) Single Tested"]
["M-T3RT","T(18-19) Raw Tested"]
["M-M3R","M(50-54) Raw"]
["M-M3RT","M(50-54) Raw Tested"]
["M-M4RT","M(55-59) Raw Tested"]
["M-M3R","M(40-44) Raw"]
["M-M2RT","M(45-49) Raw Tested"]
["M-M1RT","M(40-44) Raw Tested"]
["M-OR","Men's Open Raw"]
["M-ORT","Men's Open Raw Tested"]
["M-OS","Open Single Ply"]
["M-OST","Open Single Ply Tested"]
["M-SM S","SubM Single Ply"]
["M-SMST","SubM Single Ply Tested"]
["M-M4M","M(55-59) Multi Ply"]
["M-OM","Open Multi Ply"]
["F-Nov","Women's Novice"]
["F-OR","Women's Open Raw"]
["F-ORT","W Open Raw Tested"]
["F-JRT","WJunior Raw Tested"]
["F-M1RT","W M(40-44) Raw Tested"]
["M-JRT","Men's Junior Raw Tested"]
["M-M4MT","Men's M(55-59)Multi Tested"]
["M-M1R","M(45-49) Raw "]
["M-M2R ","M (55-59) Raw"]
["F-M1R","W M(40-44) Raw "]
{"$rows_left_out":7}
{"sheet":"Saturday","index":1,"n_rows":21,"n_cols":17,"rows_kept":21,"cut":false,"hidden":false,"merged":[[0,1,0,5]]}
[null,null,null,null,null,null,null,{"$f":"IF(ISBLANK(A1),\"\",G1*2.2046)","v":""},null,{"$f":"IF(ISBLANK(A1),\"\",I1*2.2046)","v":""},null,{"$f":"IF(ISBLANK(A1),\"\",K1*2.2046)","v":""},{"$f":"IF(ISBLANK(A1),\"\",G1+I1+K1)","v":""},{"$f":"IF(ISBLANK(A1),\"\",M1*2.2046)","v":""},{"$f":"IF(ISNUMBER(C1),IF(LEFT(F1,1)=\"M\",VLOOKUP(C1,mwf!A:B,2),VLOOKUP(C1,wwf!A:B,2)),\"\")","v":""},{"$f":"IF(ISNUMBER(B1),VLOOKUP(B1,af,2),\"\")","v":""},{"$f":"IF(ISBLANK(A1),\"\",M1*P1*O1)","v":""}]
["SATURDAY",null,"BWT","BWT","weight ","DIV","Squat","Squat","Bench","Bench","Dead","Dead","Total","Total","WgtFctr","Age Fctr","Coef."]
["Lifter's Name","Age","(kgs.)","(lbs.)","class",null,"(kgs.)","(lbs.)","(kgs.)","(lbs.)","(kgs.)","(lbs.)","(kgs.)","(lbs.)",{"$f":"IF(ISNUMBER(C3),IF(LEFT(F3,1)=\"M\",VLOOKUP(C3,mwf,2),VLOOKUP(C3,wwf,2)),\"\")","v":""},{"$f":"IF(ISNUMBER(B3),VLOOKUP(B3,af,2),\"\")","v":""}]
[null,null,null,{"$f":"IF(ISBLANK(A4),\"\",C4*2.2046)","v":""},null,null,null,{"$f":"IF(ISBLANK(A4),\"\",G4*2.2046)","v":""},null,{"$f":"IF(ISBLANK(A4),\"\",I4*2.2046)","v":""},null,{"$f":"IF(ISBLANK(A4),\"\",K4*2.2046)","v":""},{"$f":"IF(ISBLANK(A4),\"\",G4+I4+K4)","v":""},{"$f":"IF(ISBLANK(A4),\"\",M4*2.2046)","v":""},{"$f":"IF(ISNUMBER(C4),IF(LEFT(F4,1)=\"M\",VLOOKUP(C4,mwf!A:B,2),VLOOKUP(C4,wwf!A:B,2)),\"\")","v":""},{"$f":"IF(ISNUMBER(B4),VLOOKUP(B4,af,2),\"\")","v":""},{"$f":"IF(ISBLANK(A4),\"\",M4*P4*O4)","v":""}]
["Cosette Neely",37,43.8,{"$f":"IF(ISBLANK(A5),\"\",C5*2.2046)","v":96.561480000000003},97,"F-SPO",null,0,92.5,203.9255,null,0,92.5,203.9255,{"$f":"IF(ISNUMBER(C5),IF(LEFT(F5,1)=\"M\",VLOOKUP(C5,mwf!A:B,2),VLOOKUP(C5,wwf!A:B,2)),\"\")","v":1.2621},{"$f":"IF(ISNUMBER(B5),VLOOKUP(B5,af,2),\"\")","v":1},116.74424999999999]
["Kristin Floreno (Open)",33,46.8,103.17528,105,"F-MPO",85,187.39100000000002,52.5,115.7415,90,198.41400000000002,227.5,501.54650000000004,{"$f":"IF(ISNUMBER(C6),IF(LEFT(F6,1)=\"M\",VLOOKUP(C6,mwf!A:B,2),VLOOKUP(C6,wwf!A:B,2)),\"\")","v":1.2019},1,273.43225000000001]
["Kristin Floreno (Sub)",33,46.8,103.17528,105,"F-MPSM",85,187.39100000000002,52.5,115.7415,90,198.41400000000002,227.5,501.54650000000004,{"$f":"IF(ISNUMBER(C7),IF(LEFT(F7,1)=\"M\",VLOOKUP(C7,mwf!A:B,2),VLOOKUP(C7,wwf!A:B,2)),\"\")","v":1.2019},1,273.43225000000001]
["Kerri (Kady) Hurlock",17,50.4,111.11184,114,"F-SPT2",57.5,126.76450000000001,32.5,71.649500000000003,70,154.322,160,352.73599999999999,{"$f":"IF(ISNUMBER(C8),IF(LEFT(F8,1)=\"M\",VLOOKUP(C8,mwf!A:B,2),VLOOKUP(C8,wwf!A:B,2)),\"\")","v":1.1352},1.08,196.16256000000001]
["Caitlin NathalieSullivan",24,74.400000000000006,164.02224000000001,165,"F-MPO",227.5,501.54650000000004,105,231.483,182.5,402.33950000000004,515,1135.3690000000001,{"$f":"IF(ISNUMBER(C9),IF(LEFT(F9,1)=\"M\",VLOOKUP(C9,mwf!A:B,2),VLOOKUP(C9,wwf!A:B,2)),\"\")","v":0.84065000000000012},1,432.93475000000007]
["Joan Hurlock",49,69.2,152.55832000000001,165,"F-SPM2, BP",85,187.39100000000002,57.5,126.76450000000001,105,231.483,247.5,545.63850000000002,{"$f":"IF(ISNUMBER(C10),IF(LEFT(F10,1)=\"M\",VLOOKUP(C10,mwf!A:B,2),VLOOKUP(C10,wwf!A:B,2)),\"\")","v":0.88350000000000006},1.113,243.37553624999998]
["Joan Hurlock",49,69.2,152.55832000000001,165,"F-SPM2, DL",85,187.39100000000002,57.5,126.76450000000001,105,231.483,247.5,545.63850000000002,{"$f":"IF(ISNUMBER(C11),IF(LEFT(F11,1)=\"M\",VLOOKUP(C11,mwf!A:B,2),VLOOKUP(C11,wwf!A:B,2)),\"\")","v":0.88350000000000006},1.113,243.37553624999998]
["Joan Hurlock",49,69.2,152.55832000000001,165,"F-SPM2, PL",85,187.39100000000002,57.5,126.76450000000001,105,231.483,247.5,545.63850000000002,{"$f":"IF(ISNUMBER(C12),IF(LEFT(F12,1)=\"M\",VLOOKUP(C12,mwf!A:B,2),VLOOKUP(C12,wwf!A:B,2)),\"\")","v":0.88350000000000006},1.113,243.37553624999998]
["Krista Ford",48,82.5,181.87950000000001,181,"F-MPM2",237.5,523.59249999999997,110,242.506,192.5,424.38550000000004,540,1190.4840000000002,{"$f":"IF(ISNUMBER(C13),IF(LEFT(F13,1)=\"M\",VLOOKUP(C13,mwf!A:B,2),VLOOKUP(C13,wwf!A:B,2)),\"\")","v":0.78655000000000008},1.097,465.93648900000005]
["Abigail Mass",17,88,194.00480000000002,198,"F-MPT2",182.5,402.33950000000004,87.5,192.9025,132.5,292.10950000000003,402.5,887.3515000000001,{"$f":"IF(ISNUMBER(C14),IF(LEFT(F14,1)=\"M\",VLOOKUP(C14,mwf!A:B,2),VLOOKUP(C14,wwf!A:B,2)),\"\")","v":0.75695000000000001},1.08,329.04616500000003]
["Linda Koos",60,96.8,213.40528,220,"F-MPM5",null,0,47.5,104.71850000000001,null,0,47.5,104.71850000000001,{"$f":"IF(ISNUMBER(C15),IF(LEFT(F15,1)=\"M\",VLOOKUP(C15,mwf!A:B,2),VLOOKUP(C15,wwf!A:B,2)),\"\")","v":0.72485000000000011},1.34,46.136702500000013]
[null,null,null,{"$f":"IF(ISBLANK(A16),\"\",C16*2.2046)","v":""},null,null,null,{"$f":"IF(ISBLANK(A16),\"\",G16*2.2046)","v":""},null,{"$f":"IF(ISBLANK(A16),\"\",I16*2.2046)","v":""},null,{"$f":"IF(ISBLANK(A16),\"\",K16*2.2046)","v":""},{"$f":"IF(ISBLANK(A16),\"\",G16+I16+K16)","v":""},{"$f":"IF(ISBLANK(A16),\"\",M16*2.2046)","v":""},{"$f":"IF(ISNUMBER(C16),IF(LEFT(F16,1)=\"M\",VLOOKUP(C16,mwf!A:B,2),VLOOKUP(C16,wwf!A:B,2)),\"\")","v":""},{"$f":"IF(ISNUMBER(B16),VLOOKUP(B16,af,2),\"\")","v":""},{"$f":"IF(ISBLANK(A16),\"\",M16*P16*O16)","v":""}]
["Jason Gonzales",22,65.2,143.73992000000001,148,"M-SPJR",182.5,{"$f":"IF(ISBLANK(A17),\"\",G17*2.2046)","v":402.33950000000004},137.5,{"$f":"IF(ISBLANK(A17),\"\",I17*2.2046)","v":303.13249999999999},182.5,{"$f":"IF(ISBLANK(A17),\"\",K17*2.2046)","v":402.33950000000004},{"$f":"IF(ISBLANK(A17),\"\",G17+I17+K17)","v":502.5},{"$f":"IF(ISBLANK(A17),\"\",M17*2.2046)","v":1107.8115},{"$f":"IF(ISNUMBER(C17),IF(LEFT(F17,1)=\"M\",VLOOKUP(C17,mwf!A:B,2),VLOOKUP(C17,wwf!A:B,2)),\"\")","v":0.77120000000000011},1.01,{"$f":"IF(ISBLANK(A17),\"\",M17*P17*O17)","v":391.40328000000005}]
["Ed Castaneda",23,81.400000000000006,179.45444000000003,181,"M-SPJR",222.5,{"$f":"IF(ISBLANK(A18),\"\",G18*2.2046)","v":490.52350000000001},137.5,{"$f":"IF(ISBLANK(A18),\"\",I18*2.2046)","v":303.13249999999999},205,{"$f":"IF(ISBLANK(A18),\"\",K18*2.2046)","v":451.94300000000004},{"$f":"IF(ISBLANK(A18),\"\",G18+I18+K18)","v":565},{"$f":"IF(ISBLANK(A18),\"\",M18*2.2046)","v":1245.5990000000002},{"$f":"IF(ISNUMBER(C18),IF(LEFT(F18,1)=\"M\",VLOOKUP(C18,mwf!A:B,2),VLOOKUP(C18,wwf!A:B,2)),\"\")","v":0.65024999999999999},1,{"$f":"IF(ISBLANK(A18),\"\",M18*P18*O18)","v":367.39125000000001}]
["Zach Hallford",18,94.4,208.11424000000002,220,"M-SPT3",277.5,{"$f":"IF(ISBLANK(A19),\"\",G19*2.2046)","v":611.77650000000006},190,{"$f":"IF(ISBLANK(A19),\"\",I19*2.2046)","v":418.87400000000002},232.5,{"$f":"IF(ISBLANK(A19),\"\",K19*2.2046)","v":512.56950000000006},{"$f":"IF(ISBLANK(A19),\"\",G19+I19+K19)","v":700},{"$f":"IF(ISBLANK(A19),\"\",M19*2.2046)","v":1543.22},{"$f":"IF(ISNUMBER(C19),IF(LEFT(F19,1)=\"M\",VLOOKUP(C19,mwf!A:B,2),VLOOKUP(C19,wwf!A:B,2)),\"\")","v":0.59675},1.06,{"$f":"IF(ISBLANK(A19),\"\",M19*P19*O19)","v":442.7885}]
["Zach Henson",22,96.8,213.40528,220,"M-MPJR",372.5,{"$f":"IF(ISBLANK(A20),\"\",G20*2.2046)","v":821.21350000000007},227.5,{"$f":"IF(ISBLANK(A20),\"\",I20*2.2046)","v":501.54650000000004},302.5,{"$f":"IF(ISBLANK(A20),\"\",K20*2.2046)","v":666.89150000000006},{"$f":"IF(ISBLANK(A20),\"\",G20+I20+K20)","v":902.5},{"$f":"IF(ISBLANK(A20),\"\",M20*2.2046)","v":1989.6515000000002},{"$f":"IF(ISNUMBER(C20),IF(LEFT(F20,1)=\"M\",VLOOKUP(C20,mwf!A:B,2),VLOOKUP(C20,wwf!A:B,2)),\"\")","v":0.58965000000000001},1.01,{"$f":"IF(ISBLANK(A20),\"\",M20*P20*O20)","v":537.48071625}]
["Brett Cutler",23,97.6,215.16896,220,"M-SPJR",null,{"$f":"IF(ISBLANK(A21),\"\",G21*2.2046)","v":0},null,{"$f":"IF(ISBLANK(A21),\"\",I21*2.2046)","v":0},255,{"$f":"IF(ISBLANK(A21),\"\",K21*2.2046)","v":562.173},{"$f":"IF(ISBLANK(A21),\"\",G21+I21+K21)","v":255},{"$f":"IF(ISBLANK(A21),\"\",M21*2.2046)","v":562.173},{"$f":"IF(ISNUMBER(C21),IF(LEFT(F21,1)=\"M\",VLOOKUP(C21,mwf!A:B,2),VLOOKUP(C21,wwf!A:B,2)),\"\")","v":0.58745000000000003},1,{"$f":"IF(ISBLANK(A21),\"\",M21*P21*O21)","v":149.79975000000002}]

{"sheet":"Sunday 3-Lift","index":2,"n_rows":49,"n_cols":24,"rows_kept":49,"cut":false,"hidden":false,"merged":[[0,1,0,23],[25,1,25,23]]}
["2015-06-28","APF Equipped Nationals - Sunday Full Power - Kg Results"]
["Name","Age","Div","BWt (Kg)","WtCls (Kg)","Glossbrenner"," Squat  1"," Squat  2"," Squat  3","Best Squat","Bench 1","Bench 2","Bench 3","Best Bench","Sub Total","Deadlift 1","Deadlift 2","Deadlift 3","Best Deadlift","PL Total","Coeff Score","Age  & Coeff","Pl-Div-WtCl","Team"]
["Alan Borden (M3)",51,"M-SPM3",130,140,0.5403,265,287.5,-310,287.5,172.5,182.5,-192.5,182.5,470,-230,230,-245,230,700,378.21,433.80687,"1-M-SPM3-140","TGS Gym"]
["Andrew Buschbom",32,"M-MPO",117,125,0.55404999999999993,337.5,352.5,365,365,200,210,220,220,585,325,-345,null,325,910,504.18549999999993,504.18549999999993,"3-M-MPO-125","Diablo Barbell"]
["Chris A Garcia",58,"M-SPM4",99.2,100,0.58330000000000004,282.5,297.5,-320,297.5,45,null,null,45,342.5,142.5,null,null,142.5,485,282.90050000000002,365.22454550000003,"1-M-SPM4-100"]
["Craig Allen Clites",27,"M-MPO",123.8,125,0.54685000000000006,372.5,392.5,-410,392.5,227.5,257.5,-265,257.5,650,282.5,305,-320,305,955,522.24175000000002,522.24175000000002,"2-M-MPO-125","Trap Haus Barbell Club"]
["Dana Walker",38,"M-MPO",80.2,82.5,0.65670000000000006,320,-335,-335,320,240,255,-272.5,255,575,-252.5,252.5,-275,252.5,827.5,543.41925000000003,543.41925000000003,"2-M-MPO-82.5","Brutal Powerlifting"]
["Dave Hoff",27,"M-MPO",125.4,140,0.54500000000000004,480,510,-537.5,510,-437.5,null,null,0,0,null,null,null,0,0,0,0,0]
["David Woolley",34,"M-MPSM",118,125,0.55300000000000005,-237.5,245,270,270,182.5,190,200,200,470,237.5,250,272.5,272.5,742.5,410.60250000000002,410.60250000000002,"1-M-MPSM-125"]
["Dayan Neely",37,"M-MPO",107.8,110,0.56580000000000008,350,367.5,-377.5,367.5,240,null,null,240,607.5,285,300,310,310,917.5,519.12150000000008,519.12150000000008,"1-M-MPO-110","Diablo Barbell"]
["Dustin Slepicka",28,"M-MPO",181,"SHW",0.50166999999999995,-485,-517.5,-517.5,0,-257.5,null,null,0,0,345,-377.5,null,345,0,0,0,0,"Big Iron Compound"]
["Dustin Timothy Johnson",27,"M-MPO",99,100,0.58379999999999999,332.5,-352.5,352.5,352.5,217.5,-227.5,227.5,227.5,580,-275,-275,275,275,855,499.149,499.149,"1-M-MPO-100","Diablo Barbell"]
["Fred Choate",45,"M-MPM2",88,90,0.61970000000000003,-172.5,-192.5,192.5,192.5,-125,-125,125,125,317.5,172.5,182.5,192.5,192.5,510,316.04700000000003,333.42958500000003,"1-M-MPM2-90","Team Fua Ortiz Powerlifting"]
["Gary Reichert",55,"M-MPM4",70.400000000000006,75,0.72289999999999999,-205,205,-227.5,205,100,142.5,147.5,147.5,352.5,200,237.5,-250,237.5,590,426.51099999999997,522.47597499999995,"1-M-MPM4-75"]
["James Grandick (M2)",46,"M-MPM2",122.6,125,0.54820000000000002,432.5,445,-455,445,330,-345,345,345,790,305,-327.5,327.5,327.5,1117.5,612.61350000000004,654.27121800000009,"1-M-MPM2-125","Big Iron Compound"]
["James Grandick (Open)",46,"M-MPO",122.6,125,0.54820000000000002,432.5,445,-455,445,330,-345,345,345,790,305,-327.5,327.5,327.5,1117.5,612.61350000000004,654.27121800000009,"1-M-MPO-125","Big Iron Compound"]
["Joe Mass",45,"M-MPM2",124.2,125,0.54635,-310,-310,310,310,195,-205,205,205,515,227.5,242.5,250,250,765,417.95774999999998,440.94542624999997,"2-M-MPM2-125","Big Iron Compound"]
["Matt Olsen",25,"M-SPO",158,"SHW",0.51719999999999999,365,385,-400,385,-245,-245,245,245,630,-292.5,292.5,-310,292.5,922.5,477.11700000000002,477.11700000000002,"1-M-SPO-SHW","Absolute Power"]
["Mike Strom",35,"M-MPO",81.599999999999994,82.5,0.64924999999999999,345,365,-372.5,365,275,-292.5,-292.5,275,640,227.5,250,-267.5,250,890,577.83249999999998,577.83249999999998,"1-M-MPO-82.5","Monster Garage Gym"]
["Mitchell Deskis",24,"M-SPO",81.599999999999994,82.5,0.64924999999999999,245,260,277.5,277.5,147.5,157.5,-165,157.5,435,275,285,-295,285,720,467.46,467.46,"1-M-SPO-82.5"]
["Ryan Marble",28,"M-SPO",89,90,0.61570000000000003,252.5,-265,265,265,220,235,245,245,510,-237.5,-237.5,237.5,237.5,747.5,460.23575,460.23575,"1-M-SPO-90","Brutal Powerlifting"]
["Scott Kuderick",41,"M-MPO",90,90,0.61185,-305,305,null,305,160,null,null,160,465,222.5,245,-272.5,245,710,434.4135,438.75763499999999,"1-M-MPO-90","Liberation Garage Barbell"]
["Steve Brock (M1)",44,"M-MPM1",138,140,0.53280000000000005,-422.5,-422.5,-422.5,0,-295,null,null,0,0,null,null,null,0,0,0,0,0,"Monster Garage Gym"]
["Steve Brock (Open)",44,"M-MPO",138,140,0.53280000000000005,-422.5,-422.5,-422.5,0,-295,null,null,0,0,null,null,null,0,0,0,0,0,"Monster Garage Gym"]
[]
[null,"APF Equipped Nationals - Sunday Full Power - Lb Results"]
["Name","Age","Div","BWt (Kg)","WtCls (Kg)","Glossbrenner"," Squat  1"," Squat  2"," Squat  3","Best Squat","Bench 1","Bench 2","Bench 3","Best Bench","Sub Total","Deadlift 1","Deadlift 2","Deadlift 3","Best Deadlift","PL Total","Coeff Score","Age  & Coeff","Pl-Div-WtCl","Team"]
["Alan Borden (M3)",51,"M-SPM3",130,140,0.5403,584.21900000000005,633.82249999999999,-683.42600000000004,633.82249999999999,380.29349999999999,402.33950000000004,-424.38550000000004,402.33950000000004,1036.162,-507.05800000000005,507.05800000000005,-540.12700000000007,507.05800000000005,1543.22,378.21,433.80687,"1-M-SPM3-140","TGS Gym"]
["Andrew Buschbom",32,"M-MPO",117,125,0.55404999999999993,744.05250000000001,777.12150000000008,804.67900000000009,804.67900000000009,440.92,462.96600000000001,485.012,485.012,1289.691,716.495,-760.58699999999999,0,716.495,2006.1860000000001,504.18549999999993,504.18549999999993,"3-M-MPO-125","Diablo Barbell"]
["Chris A Garcia",58,"M-SPM4",99.2,100,0.58330000000000004,622.79950000000008,655.86850000000004,-705.47199999999998,655.86850000000004,99.207000000000008,0,0,99.207000000000008,755.07550000000003,314.15550000000002,0,0,314.15550000000002,1069.231,282.90050000000002,365.22454550000003,"1-M-SPM4-100"]
{"$rows_left_out":20}
{"sheet":"Sunday Deadlift","index":3,"n_rows":31,"n_cols":15,"rows_kept":31,"cut":false,"hidden":false,"merged":[[0,1,0,14],[16,1,16,14]]}
["2015-06-28","APF Equipped Nationals - Sunday Deadlift Only - Kg Results"]
["Name","Age","Div","BWt (Kg)","WtCls (Kg)","Glossbrenner","Deadlift 1","Deadlift 2","Deadlift 3","Deadlift 4","Best Deadlift","Coeff Score","Age  & Coeff","Pl-Div-WtCl","Team"]
["Aaron Chavez",42,"M-SPM1",145,"SHW",0.52695000000000003,287.5,300,-318,null,300,158.08500000000001,161.2467,"1-M-SPM1-SHW"]
["Alan Borden (M3)",51,"M-SPM3",130,140,0.5403,-230,230,-245,null,230,124.26900000000001,142.53654299999999,"1-M-SPM3-140","TGS Gym"]
["Alan Borden (Open)",51,"M-SPO",130,140,0.5403,-230,230,-245,null,230,124.26900000000001,142.53654299999999,"1-M-SPO-140","TGS Gym"]
["Chris McGrail (mp)",36,"M-MPO",82.1,82.5,0.64664999999999995,-300,300,312.5,-320,312.5,202.07812499999997,202.07812499999997,"1-M-MPO-82.5","Brutal Powerlifting"]
["Chris McGrail (sp)",36,"M-SPO",82.1,82.5,0.64664999999999995,-300,300,312.5,-320,312.5,202.07812499999997,202.07812499999997,"1-M-SPO-82.5","Brutal Powerlifting"]
["Dana Walker",38,"M-MPO",80.2,82.5,0.65670000000000006,-252.5,252.5,-275,null,252.5,165.81675000000001,165.81675000000001,"2-M-MPO-82.5","Brutal Powerlifting"]
["Dick Zenzen",63,"M-MPM5",113.8,125,0.55759999999999998,195,210,null,null,210,117.096,166.393416,"1-M-MPM5-125","Zenzen Barbell"]
["Dustin Slepicka",28,"M-MPO",181,"SHW",0.50166999999999995,345,-377.5,null,null,345,173.07614999999998,173.07614999999998,"1-M-MPO-SHW","Big Iron Compound"]
["Greg Ripley",54,"M-SPM3",75,75,0.68855,-190,null,null,null,0,0,0,0,"Motor City Barbell"]
["Jake Jensen",25,"M-SPO",108.4,110,0.56484999999999996,295,-300,-300,null,295,166.63074999999998,166.63074999999998,"1-M-SPO-110"]
["Lance Davis",48,"M-SPM2",109,110,0.56394999999999995,227.5,-250,-250,null,227.5,128.29862499999999,140.74359162499999,"1-M-SPM2-110","Brutal Powerlifting"]
["Michael Deskis",56,"M-SPM4",66,67.5,0.76300000000000001,237.5,-247.5,-247.5,null,237.5,181.21250000000001,225.790775,"1-M-SPM4-67.5"]
["Shayne Day",25,"M-SPO",95.4,100,0.59375,290,-305,-305,null,290,172.1875,172.1875,"1-M-SPO-100"]
[]
[null,"APF Equipped Nationals - Sunday Deadlift Only - Lb Results"]
["Name","Age","Div","BWt (Kg)","WtCls (Kg)","Glossbrenner","Deadlift 1","Deadlift 2","Deadlift 3","Deadlift 4","Best Deadlift","Coeff Score","Age  & Coeff","Pl-Div-WtCl","Team"]
["Aaron Chavez",42,"M-SPM1",145,"SHW",0.52695000000000003,633.82249999999999,661.38,-701.06280000000004,0,661.38,158.08500000000001,161.2467,"1-M-SPM1-SHW"]
["Alan Borden (M3)",51,"M-SPM3",130,140,0.5403,-507.05800000000005,507.05800000000005,-540.12700000000007,0,507.05800000000005,124.26900000000001,142.53654299999999,"1-M-SPM3-140","TGS Gym"]
["Alan Borden (Open)",51,"M-SPO",130,140,0.5403,-507.05800000000005,507.05800000000005,-540.12700000000007,0,507.05800000000005,124.26900000000001,142.53654299999999,"1-M-SPO-140","TGS Gym"]
["Chris McGrail (mp)",36,"M-MPO",82.1,82.5,0.64664999999999995,-661.38,661.38,688.9375,-705.47199999999998,688.9375,202.07812499999997,202.07812499999997,"1-M-MPO-82.5","Brutal Powerlifting"]
["Chris McGrail (sp)",36,"M-SPO",82.1,82.5,0.64664999999999995,-661.38,661.38,688.9375,-705.47199999999998,688.9375,202.07812499999997,202.07812499999997,"1-M-SPO-82.5","Brutal Powerlifting"]
["Dana Walker",38,"M-MPO",80.2,82.5,0.65670000000000006,-556.66150000000005,556.66150000000005,-606.26499999999999,0,556.66150000000005,165.81675000000001,165.81675000000001,"2-M-MPO-82.5","Brutal Powerlifting"]
["Dick Zenzen",63,"M-MPM5",113.8,125,0.55759999999999998,429.89700000000005,462.96600000000001,0,0,462.96600000000001,117.096,166.393416,"1-M-MPM5-125","Zenzen Barbell"]
["Dustin Slepicka",28,"M-MPO",181,"SHW",0.50166999999999995,760.58699999999999,-832.23650000000009,0,0,760.58699999999999,173.07614999999998,173.07614999999998,"1-M-MPO-SHW","Big Iron Compound"]
["Greg Ripley",54,"M-SPM3",75,75,0.68855,-418.87400000000002,0,0,0,0,0,0,0,"Motor City Barbell"]
["Jake Jensen",25,"M-SPO",108.4,110,0.56484999999999996,650.35700000000008,-661.38,-661.38,0,650.35700000000008,166.63074999999998,166.63074999999998,"1-M-SPO-110"]
["Lance Davis",48,"M-SPM2",109,110,0.56394999999999995,501.54650000000004,-551.15,-551.15,0,501.54650000000004,128.29862499999999,140.74359162499999,"1-M-SPM2-110","Brutal Powerlifting"]
["Michael Deskis",56,"M-SPM4",66,67.5,0.76300000000000001,523.59249999999997,-545.63850000000002,-545.63850000000002,0,523.59249999999997,181.21250000000001,225.790775,"1-M-SPM4-67.5"]
{"$rows_left_out":2}
{"sheet":"Sunday Bench","index":4,"n_rows":15,"n_cols":15,"rows_kept":15,"cut":false,"hidden":false,"merged":[[0,1,0,14],[8,1,8,14]]}
["2015-06-28","APF Equipped Nationals - Sunday Bench Only - Kg Results"]
["Name","Age","Div","BWt (Kg)","WtCls (Kg)","Glossbrenner","Bench 1","Bench 2","Bench 3","Bench 4","Best Bench","Coeff Score","Age  & Coeff","Pl-Div-WtCl","Team"]
["Dana Walker",38,"M-MPO",80.2,82.5,0.65670000000000006,240,255,-272.5,null,255,167.45850000000002,167.45850000000002,"1-M-MPO-82.5","Brutal Powerlifting"]
["Jay Anderson (Open)",37,"M-SPO",118.2,125,0.55279999999999996,247.5,260,272.5,-285.5,272.5,150.63799999999998,150.63799999999998,"1-M-SPO-125","Brutal Powerlifting"]
["Jay Anderson (SM)",37,"M-SPSM",118.2,125,0.55279999999999996,247.5,260,272.5,-285.5,272.5,150.63799999999998,150.63799999999998,"1-M-SPSM-125","Brutal Powerlifting"]
["Larry Mistric",58,"M-MPM4",109.2,110,0.56364999999999998,222.5,250,-272.5,null,250,140.91249999999999,181.91803749999997,"1-M-MPM4-110","McDaniel's"]
["Michael Deskis",56,"M-SPM4",66,67.5,0.76300000000000001,102.5,107.5,112.5,-117.5,112.5,85.837500000000006,106.95352500000001,"1-M-SPM4-67.5"]
[]
[null,"APF Equipped Nationals - Sunday Bench Only - Lb Results"]
["Name","Age","Div","BWt (Kg)","WtCls (Kg)","Glossbrenner","Bench 1","Bench 2","Bench 3","Bench 4","Best Bench","Coeff Score","Age  & Coeff","Pl-Div-WtCl","Team"]
["Dana Walker",38,"M-MPO",80.2,82.5,0.65670000000000006,529.10400000000004,562.173,-600.75350000000003,0,562.173,167.45850000000002,167.45850000000002,"1-M-MPO-82.5","Brutal Powerlifting"]
["Jay Anderson (Open)",37,"M-SPO",118.2,125,0.55279999999999996,545.63850000000002,573.19600000000003,600.75350000000003,-629.41330000000005,600.75350000000003,150.63799999999998,150.63799999999998,"1-M-SPO-125","Brutal Powerlifting"]
["Jay Anderson (SM)",37,"M-SPSM",118.2,125,0.55279999999999996,545.63850000000002,573.19600000000003,600.75350000000003,-629.41330000000005,600.75350000000003,150.63799999999998,150.63799999999998,"1-M-SPSM-125","Brutal Powerlifting"]
["Larry Mistric",58,"M-MPM4",109.2,110,0.56364999999999998,490.52350000000001,551.15,-600.75350000000003,0,551.15,140.91249999999999,181.91803749999997,"1-M-MPM4-110","McDaniel's"]
["Michael Deskis",56,"M-SPM4",66,67.5,0.76300000000000001,225.97150000000002,236.99450000000002,248.01750000000001,-259.04050000000001,248.01750000000001,85.837500000000006,106.95352500000001,"1-M-SPM4-67.5"]

{"sheet":"Age Factors","index":5,"n_rows":67,"n_cols":2,"rows_kept":67,"cut":false,"hidden":true,"merged":[]}
[0,1]
[14,1.23]
[15,1.18]
[16,1.1299999999999999]
[17,1.08]
[18,1.06]
[20,1.03]
[21,1.02]
[22,1.01]
[23,1]
[24,1]
[25,1]
[26,1]
[27,1]
[28,1]
[29,1]
[30,1]
[31,1]
[32,1]
[33,1]
[34,1]
[35,1]
[36,1]
[37,1]
[38,1]
[39,1]
[40,1]
[41,1.01]
[42,1.02]
[43,1.0309999999999999]
{"$rows_left_out":38}
{"sheet":"mwf","index":6,"n_rows":3031,"n_cols":2,"rows_kept":3031,"cut":false,"hidden":true,"merged":[]}
[0,1.3243499999999999]
[40,1.3243499999999999]
[40.049999999999997,1.3222499999999999]
[40.1,1.3201499999999999]
[40.15,1.3180700000000001]
[40.200000000000003,1.3160000000000001]
[40.25,1.3139000000000001]
[40.299999999999997,1.3118000000000001]
[40.35,1.30972]
[40.4,1.30765]
[40.450000000000003,1.3056000000000001]
[40.5,1.30355]
[40.549999999999997,1.3015000000000001]
[40.6,1.29945]
[40.65,1.29742]
[40.700000000000003,1.2954000000000001]
[40.75,1.2934000000000001]
[40.799999999999997,1.2914000000000001]
[40.85,1.2894000000000001]
[40.9,1.2874000000000001]
[40.950000000000003,1.2854000000000001]
[41,1.2834000000000001]
[41.05,1.28142]
[41.1,1.27945]
[41.15,1.2774700000000001]
[41.2,1.2755000000000001]
[41.25,1.27355]
[41.3,1.2716000000000001]
[41.35,1.2696700000000001]
[41.4,1.2677499999999999]
{"$rows_left_out":3002}
{"sheet":"wwf","index":7,"n_rows":2211,"n_cols":2,"rows_kept":2211,"cut":false,"hidden":true,"merged":[]}
[0,1.3437000000000001]
[40,1.3437000000000001]
[40.049999999999997,1.3426]
[40.1,1.3414999999999999]
[40.15,1.3404]
[40.200000000000003,1.3392999999999999]
[40.25,1.3381000000000001]
[40.299999999999997,1.337]
[40.35,1.3359000000000001]
[40.4,1.3348]
[40.450000000000003,1.3336999999999999]
[40.5,1.3326]
[40.549999999999997,1.3315000000000001]
[40.6,1.3305]
[40.65,1.3294000000000001]
[40.700000000000003,1.3283]
[40.75,1.3271999999999999]
[40.799999999999997,1.3261000000000001]
[40.85,1.325]
[40.9,1.3239000000000001]
[40.950000000000003,1.3228]
[41,1.3217000000000001]
[41.05,1.3206]
[41.1,1.3195000000000001]
[41.15,1.3184]
[41.2,1.3174000000000001]
[41.25,1.3163]
[41.3,1.3151999999999999]
[41.35,1.3141]
[41.4,1.3129999999999999]
{"$rows_left_out":2182}
{"sheet":"Classes","index":8,"n_rows":680,"n_cols":6,"rows_kept":680,"cut":false,"hidden":true,"merged":[]}
["Class","AF","WF","BL","Kmax","Stat"]
["Men AAPF Guest",0,1,0,227.5,"A"]
[]
[]
["Men AAPF Novice",0,1,0,227.5,"A"]
["Men AAPF Teen",1,1,1,227.5,"A"]
["Men AAPF Teen 13-15",1,1,1,227.5,"A"]
["Men AAPF Teen 13-15 114 1/2",1,1,1,52,"A"]
["Men AAPF Teen 13-15 123 1/2",1,1,1,56,"A"]
["Men AAPF Teen 13-15 132 1/4",1,1,1,60,"A"]
["Men AAPF Teen 13-15 148 3/4",1,1,1,67.5,"A"]
["Men AAPF Teen 13-15 165 1/4",1,1,1,75,"A"]
["Men AAPF Teen 13-15 181 3/4",1,1,1,82.5,"A"]
["Men AAPF Teen 13-15 198 1/4",1,1,1,90,"A"]
["Men AAPF Teen 13-15 220 1/4",1,1,1,100,"A"]
["Men AAPF Teen 13-15 242 1/2",1,1,1,110,"A"]
["Men AAPF Teen 13-15 275 1/4",1,1,1,125,"A"]
["Men AAPF Teen 13-15 308",1,1,1,140,"A"]
["Men AAPF Teen 13-15 SHW",1,1,1,227.5,"A"]
["Men AAPF Teen 16-17",1,1,1,227.5,"A"]
["Men AAPF Teen 16-17 114 1/2",1,1,1,52,"A"]
["Men AAPF Teen 16-17 123 1/2",1,1,1,56,"A"]
["Men AAPF Teen 16-17 132 1/4",1,1,1,60,"A"]
["Men AAPF Teen 16-17 148 3/4",1,1,1,67.5,"A"]
["Men AAPF Teen 16-17 165 1/4",1,1,1,75,"A"]
["Men AAPF Teen 16-17 181 3/4",1,1,1,82.5,"A"]
["Men AAPF Teen 16-17 198 1/4",1,1,1,90,"A"]
["Men AAPF Teen 16-17 220 1/4",1,1,1,100,"A"]
["Men AAPF Teen 16-17 242 1/2",1,1,1,110,"A"]
["Men AAPF Teen 16-17 275 1/4",1,1,1,125,"A"]
{"$rows_left_out":651}
{"sheet":"Module1","index":9,"n_rows":0,"n_cols":0,"rows_kept":0,"cut":false,"hidden":true,"merged":[]}