{"text_format":"1","workbook":"xlsx","n_sheets":16,"sheets":["Setup","Weigh-in","Loading Chart","Lifting","BarLoad","Upcoming Flights","3-Lift","Squat","Bench","Deadlift","DATA","Push-Pull","PrintSheet","Awards","Please read","Black & White load sheet"],"not_rendered":{"charts":2,"images":24,"macros":1,"external_links":0,"defined_names":8,"comments":0,"pivot_tables":0},"unopened":[],"bounds":{"document_bytes":16777216,"sheet_cells":100000,"rows_first":2000,"rows_last":500,"rows_between":2000,"halvings":0,"cell_chars":16384,"cell_head_chars":4096},"cells_cut":0,"cells_raw":0,"read":"whole","date_system":"1900"}

{"sheet":"Setup","index":0,"n_rows":246,"n_cols":58,"rows_kept":246,"cut":false,"hidden":false,"merged":[[43,2,43,3],[43,4,43,7],[45,4,45,5],[46,2,46,7],[40,2,40,4],[40,5,40,7],[41,2,41,3],[41,4,41,7],[42,2,42,3],[42,4,42,7],[1,10,1,12],[35,4,35,7],[38,2,38,7],[37,4,37,5],[35,2,35,3],[24,3,25,5],[24,6,25,6],[33,4,33,7],[32,2,32,4],[32,5,32,7],[29,10,30,12],[27,3,28,6],[27,10,28,12],[34,4,34,7],[34,2,34,3],[33,2,33,3],[1,18,1,19],[3,18,4,18],[3,19,4,19],[21,7,22,7],[20,2,20,3],[20,5,20,6],[3,14,4,16],[1,14,1,16],[3,7,4,7],[5,2,5,4],[5,5,5,7],[21,4,22,4],[5,10,6,12],[3,10,4,12],[3,2,4,6],[1,2,1,7]]}
[null,null,null,null,null,null,null,null,null,null,null,{"$f":"IF(K6=\"BWt (Lb)\",CONCATENATE(\"DATA!F14:F28\"),CONCATENATE(\"DATA!E14:E28\"))","v":"DATA!E14:E28"},null,null,null,null,null,null,null,null,null,null,null,null,null,null,null,null,null,null,null,null,null,null,null,null,null,null,null,null,null,null,null,null,null,null,null,null,null,null,null,null,null,"Powerlifting (3 lift meet)","Bench Press Only","Squat Only","Deadlift Only","Push Pull (Bench & Deadlift)"]
[null,null,"Contest Name",null,null,null,null,null,null,null,"Date",null,null,null,"Powerlifting (3 lift meet)",null,null,null,"Team Points",null,null,null,null,"FTP Site"]
[null,null,null,null,null,null,null,null,null,null,null,null,null,null,null,null,null,null,null,null,null,null,null,"Local Folder",null,null,null,null,null,"S",{"$f":"$G$22","v":30},{"$f":"$D$22","v":65}]
[null,null,"Platform Weight Set",null,null,null,null,"Kg",null,null,"Weight Classes",null,null,null,"Divisions",null,null,null,"Place","Points",null,null,null,null,null,null,null,null,null,"B",{"$f":"$G$23","v":22.5},{"$f":"$D$23","v":55}]
[null,null,null,null,null,null,null,null,null,null,null,null,null,null,null,null,null,null,null,null,null,null,null,null,null,null,null,null,null,"D",{"$f":"$G$24","v":25},{"$f":"$D$24","v":55}]
[null,null,"Pounds",null,null,"Kilos",null,null,null,null,"BWt (Kg)",null,null,null,"Abbrev","Description","Scoring",null,1,3]
[null,null,{"$f":"LEFT(TRIM(Lifting!B3),1)","v":"D"},{"$f":"ABS(Lifting!D3)","v":{"$error":"#N/A"}},null,null,{"$f":"ABS(Lifting!D3)","v":{"$error":"#N/A"}},null,null,null,null,null,null,null,"M_OR_APF","Male Open Raw APF",1,null,null,2]
[null,null,"How","Pound","LOAD","How","Kilo","LOAD",null,"limit","Men",null,"Women",null,"M_OR_AAPF","Male Open Raw AAPF",1,null,null,1]
[null,null,"Many?","Plates","on Bar","Many?","Plates","on Bar",null,10,52,10,44,null,"M_OCR_APF","Male Open Classic Raw APF",1,null,null,0]
[null,null,0,110,{"$f":"IF(OR(D7=0,H4=\"Kg\"),0,MIN(INT(($D$7-VLOOKUP($C$7,$AD$3:$AF$5,3,FALSE))/(2*D10)),C10/2))","v":{"$error":"#N/A"}},0,50,{"$f":"IF(OR(G7=0,H4=\"Lb\"),0,MIN(INT(($G$7-VLOOKUP($C$7,$AD$3:$AF$5,2,FALSE))/(2*G10)),F10/2))","v":{"$error":"#N/A"}},null,{"$f":"IF(K9=\"SHW\",1000,IF(K10=\"\",J9+1,IF(ISERROR(VLOOKUP(K9,DATA!$F$32:$G$59,2,FALSE)),K9,VLOOKUP(K9,DATA!$F$32:$G$59,2,FALSE))+0.0001))","v":52.000100000000003},56,44.000100000000003,48,null,"M_OCR_AAPF","Male Open Classic Raw AAPF",1,null,null,0]
[null,null,8,100,{"$f":"IF(OR(D7=0,H4=\"Kg\"),0,MIN(INT(($D$7-VLOOKUP($C$7,$AD$3:$AF$5,3,FALSE)-2*E10*D10)/(2*D11)),C11/2))","v":{"$error":"#N/A"}},0,45,{"$f":"IF(OR(G7=0,H4=\"Lb\"),0,MIN(INT(($G$7-VLOOKUP($C$7,$AD$3:$AF$5,2,FALSE)-2*H10*G10)/(2*G11)),F11/2))","v":{"$error":"#N/A"}},null,{"$f":"IF(K10=\"SHW\",1000,IF(K11=\"\",J10+1,IF(ISERROR(VLOOKUP(K10,DATA!$F$32:$G$59,2,FALSE)),K10,VLOOKUP(K10,DATA!$F$32:$G$59,2,FALSE))+0.001))","v":56.000999999999998},60,48.000999999999998,52,null,"M_OEM_APF","Male Open Equipped Multiply APF",1,null,null,0]
[null,null,0,50,{"$f":"IF(OR(D7=0,H4=\"Kg\"),0,MIN(INT(($D$7-VLOOKUP($C$7,$AD$3:$AF$5,3,FALSE)-2*E10*D10-2*E11*D11)/(2*D12)),C12/2))","v":{"$error":"#N/A"}},20,25,{"$f":"IF(OR(G7=0,H4=\"Lb\"),0,MIN(INT(($G$7-VLOOKUP($C$7,$AD$3:$AF$5,2,FALSE)-2*H10*G10-2*H11*G11)/(2*G12)),F12/2))","v":{"$error":"#N/A"}},null,{"$f":"IF(K11=\"SHW\",1000,IF(K12=\"\",J11+1,IF(ISERROR(VLOOKUP(K11,DATA!$F$32:$G$59,2,FALSE)),K11,VLOOKUP(K11,DATA!$F$32:$G$59,2,FALSE))+0.001))","v":60.000999999999998},67.5,52.000999999999998,56,null,"M_OEM_AAPF","Male Open Equipped Multiply AAPF",1,null,null,0]
[null,null,10,45,{"$f":"IF(OR(D7=0,H4=\"Kg\"),0,MIN(INT(($D$7-VLOOKUP($C$7,$AD$3:$AF$5,3,FALSE)-2*E10*D10-2*E11*D11-2*E12*D12)/(2*D13)),C13/2))","v":{"$error":"#N/A"}},2,20,{"$f":"IF(OR(G7=0,H4=\"Lb\"),0,MIN(INT(($G$7-VLOOKUP($C$7,$AD$3:$AF$5,2,FALSE)-2*H10*G10-2*H11*G11-2*H12*G12)/(2*G13)),F13/2))","v":{"$error":"#N/A"}},null,{"$f":"IF(K12=\"SHW\",1000,IF(K13=\"\",J12+1,IF(ISERROR(VLOOKUP(K12,DATA!$F$32:$G$59,2,FALSE)),K12,VLOOKUP(K12,DATA!$F$32:$G$59,2,FALSE))+0.001))","v":67.501000000000005},75,56.000999999999998,60,null,"M_OES_APF","Male Open Equipped Single-Ply APF",1,null,null,0]
[null,null,2,35,{"$f":"IF(OR(D7=0,H4=\"Kg\"),0,MIN(INT(($D$7-VLOOKUP($C$7,$AD$3:$AF$5,3,FALSE)-2*E10*D10-2*E11*D11-2*E12*D12-2*E13*D13)/(2*D14)),C14/2))","v":{"$error":"#N/A"}},0,15,{"$f":"IF(OR(G7=0,H4=\"Lb\"),0,MIN(INT(($G$7-VLOOKUP($C$7,$AD$3:$AF$5,2,FALSE)-2*H10*G10-2*H11*G11-2*H12*G12-2*H13*G13)/(2*G14)),F14/2))","v":{"$error":"#N/A"}},null,{"$f":"IF(K13=\"SHW\",1000,IF(K14=\"\",J13+1,IF(ISERROR(VLOOKUP(K13,DATA!$F$32:$G$59,2,FALSE)),K13,VLOOKUP(K13,DATA!$F$32:$G$59,2,FALSE))+0.001))","v":75.001000000000005},82.5,60.000999999999998,67.5,null,"M_OES_AAPF","Male Open Equipped Single-Ply AAPF",1,null,null,0]
[null,null,2,25,{"$f":"IF(OR(D7=0,H4=\"Kg\"),0,MIN(INT(($D$7-VLOOKUP($C$7,$AD$3:$AF$5,3,FALSE)-2*E10*D10-2*E11*D11-2*E12*D12-2*E13*D13-2*E14*D14)/(2*D15)),C15/2))","v":{"$error":"#N/A"}},2,10,{"$f":"IF(OR(G7=0,H4=\"Lb\"),0,MIN(INT(($G$7-VLOOKUP($C$7,$AD$3:$AF$5,2,FALSE)-2*H10*G10-2*H11*G11-2*H12*G12-2*H13*G13-2*H14*G14)/(2*G15)),F15/2))","v":{"$error":"#N/A"}},null,{"$f":"IF(K14=\"SHW\",1000,IF(K15=\"\",J14+1,IF(ISERROR(VLOOKUP(K14,DATA!$F$32:$G$59,2,FALSE)),K14,VLOOKUP(K14,DATA!$F$32:$G$59,2,FALSE))+0.001))","v":82.501000000000005},90,67.501000000000005,75,null,"M_TR_1_APF","Male Teen 1 Raw APF: 13-15",1,null,null,0]
[null,null,4,10,{"$f":"IF(OR(D7=0,H4=\"Kg\"),0,MIN(INT(($D$7-VLOOKUP($C$7,$AD$3:$AF$5,3,FALSE)-2*E10*D10-2*E11*D11-2*E12*D12-2*E13*D13-2*E14*D14-2*E15*D15)/(2*D16)),C16/2))","v":{"$error":"#N/A"}},2,5,{"$f":"IF(OR(G7=0,H4=\"Lb\"),0,MIN(INT(($G$7-VLOOKUP($C$7,$AD$3:$AF$5,2,FALSE)-2*H10*G10-2*H11*G11-2*H12*G12-2*H13*G13-2*H14*G14-2*H15*G15)/(2*G16)),F16/2))","v":{"$error":"#N/A"}},null,{"$f":"IF(K15=\"SHW\",1000,IF(K16=\"\",J15+1,IF(ISERROR(VLOOKUP(K15,DATA!$F$32:$G$59,2,FALSE)),K15,VLOOKUP(K15,DATA!$F$32:$G$59,2,FALSE))+0.001))","v":90.001000000000005},100,75.001000000000005,82.5,null,"M_TR_1_AAPF","Male Teen 1 Raw AAPF: 13-15",1]
[null,null,2,5,{"$f":"IF(OR(D7=0,H4=\"Kg\"),0,MIN(INT(($D$7-VLOOKUP($C$7,$AD$3:$AF$5,3,FALSE)-2*E10*D10-2*E11*D11-2*E12*D12-2*E13*D13-2*E14*D14-2*E15*D15-2*E16*D16)/(2*D17)),C17/2))","v":{"$error":"#N/A"}},2,2.5,{"$f":"IF(OR(G7=0,H4=\"Lb\"),0,MIN(INT(($G$7-VLOOKUP($C$7,$AD$3:$AF$5,2,FALSE)-2*H10*G10-2*H11*G11-2*H12*G12-2*H13*G13-2*H14*G14-2*H15*G15-2*H16*G16)/(2*G17)),F17/2))","v":{"$error":"#N/A"}},null,{"$f":"IF(K16=\"SHW\",1000,IF(K17=\"\",J16+1,IF(ISERROR(VLOOKUP(K16,DATA!$F$32:$G$59,2,FALSE)),K16,VLOOKUP(K16,DATA!$F$32:$G$59,2,FALSE))+0.001))","v":100.001},110,82.501000000000005,90,null,"M_TCR_1_APF","Male Teen 1 Classic Raw APF: 13-15",1]
[null,null,2,2.5,{"$f":"IF(OR(D7=0,H4=\"Kg\"),0,MIN(INT(($D$7-VLOOKUP($C$7,$AD$3:$AF$5,3,FALSE)-2*E10*D10-2*E11*D11-2*E12*D12-2*E13*D13-2*E14*D14-2*E15*D15-2*E16*D16-2*E17*D17)/(2*D18)),C18/2))","v":{"$error":"#N/A"}},2,1.25,{"$f":"IF(OR(G7=0,H4=\"Lb\"),0,INT(($G$7-VLOOKUP($C$7,$AD$3:$AF$5,2,FALSE)-2*H10*G10-2*H11*G11-2*H12*G12-2*H13*G13-2*H14*G14-2*H15*G15-2*H16*G16-2*H17*G17)/(2*G18)))","v":{"$error":"#N/A"}},null,{"$f":"IF(K17=\"SHW\",1000,IF(K18=\"\",J17+1,IF(ISERROR(VLOOKUP(K17,DATA!$F$32:$G$59,2,FALSE)),K17,VLOOKUP(K17,DATA!$F$32:$G$59,2,FALSE))+0.001))","v":110.001},125,90.001000000000005,"SHW",null,"M_TCR_1_AAPF","Male Teen 1 Classic Raw AAPF: 13-15",1]
[null,null,0,1,{"$f":"IF(OR(D7=0,H4=\"Kg\"),0,MIN(INT(($D$7-VLOOKUP($C$7,$AD$3:$AF$5,3,FALSE)-2*E10*D10-2*E11*D11-2*E12*D12-2*E13*D13-2*E14*D14-2*E15*D15-2*E16*D16-2*E17*D17-2*E18*D18)/(2*D19)),C19/2))","v":{"$error":"#N/A"}},2,0.5,{"$f":"IF(OR(G7=0,H4=\"Lb\"),0,INT(($G$7-VLOOKUP($C$7,$AD$3:$AF$5,2,FALSE)-2*H10*G10-2*H11*G11-2*H12*G12-2*H13*G13-2*H14*G14-2*H15*G15-2*H16*G16-2*H17*G17-2*H18*G18)/(2*G19)))","v":{"$error":"#N/A"}},null,{"$f":"IF(K18=\"SHW\",1000,IF(K19=\"\",J18+1,IF(ISERROR(VLOOKUP(K18,DATA!$F$32:$G$59,2,FALSE)),K18,VLOOKUP(K18,DATA!$F$32:$G$59,2,FALSE))+0.001))","v":125.001},140,1000,null,null,"M_TEM_1_APF","Male Teen 1 Equipped Multiply APF: 13-15",1]
[null,null,0,0.5,{"$f":"IF(OR(D7=0,H4=\"Kg\"),0,MIN(INT(($D$7-VLOOKUP($C$7,$AD$3:$AF$5,3,FALSE)-2*E10*D10-2*E11*D11-2*E12*D12-2*E13*D13-2*E14*D14-2*E15*D15-2*E16*D16-2*E17*D17-2*E18*D18-2*E19*D19)/(2*D20)),C20/2))","v":{"$error":"#N/A"}},0,0.25,{"$f":"IF(OR(G7=0,H4=\"Lb\"),0,INT(($G$7-VLOOKUP($C$7,$AD$3:$AF$5,2,FALSE)-2*H10*G10-2*H11*G11-2*H12*G12-2*H13*G13-2*H14*G14-2*H15*G15-2*H16*G16-2*H17*G17-2*H18*G18-2*H19*G19)/(2*G20)))","v":{"$error":"#N/A"}},null,{"$f":"IF(K19=\"SHW\",1000,IF(K20=\"\",J19+1,IF(ISERROR(VLOOKUP(K19,DATA!$F$32:$G$59,2,FALSE)),K19,VLOOKUP(K19,DATA!$F$32:$G$59,2,FALSE))+0.001))","v":140.001},"SHW",1001,null,null,"M_TEM_1_AAPF","Male Teen 1 Equipped Multiply AAPF: 13-15",1]
[null,null,"Bar plus Collars",null,1,"Bar plus Collars",null,1,null,{"$f":"IF(K20=\"SHW\",1000,IF(K21=\"\",J20+1,IF(ISERROR(VLOOKUP(K20,DATA!$F$32:$G$59,2,FALSE)),K20,VLOOKUP(K20,DATA!$F$32:$G$59,2,FALSE))+0.001))","v":1000},null,{"$f":"IF(M20=\"SHW\",1000,IF(M21=\"\",L20+1,IF(ISERROR(VLOOKUP(M20,DATA!$F$32:$G$59,2,FALSE)),M20,VLOOKUP(M20,DATA!$F$32:$G$59,2,FALSE))+0.001))","v":1002},null,null,"M_TES_1_APF","Male Teen 1 Equipped Single-Ply APF: 13-15",1]
[null,null,"Squat",65,"Pounds","Squat",30,"Kilos",null,{"$f":"IF(K21=\"SHW\",1000,IF(K22=\"\",J21+1,IF(ISERROR(VLOOKUP(K21,DATA!$F$32:$G$59,2,FALSE)),K21,VLOOKUP(K21,DATA!$F$32:$G$59,2,FALSE))+0.001))","v":1001},null,{"$f":"IF(M21=\"SHW\",1000,IF(M22=\"\",L21+1,IF(ISERROR(VLOOKUP(M21,DATA!$F$32:$G$59,2,FALSE)),M21,VLOOKUP(M21,DATA!$F$32:$G$59,2,FALSE))+0.001))","v":1003},null,null,"M_TES_1_AAPF","Male Teen 1 Equipped Single-PlyAAPF: 13-15",1]
[null,null,"BP",55,null,"BP",22.5,null,null,{"$f":"IF(K22=\"SHW\",1000,IF(K23=\"\",J22+1,IF(ISERROR(VLOOKUP(K22,DATA!$F$32:$G$59,2,FALSE)),K22,VLOOKUP(K22,DATA!$F$32:$G$59,2,FALSE))+0.001))","v":1002},null,{"$f":"IF(M22=\"SHW\",1000,IF(M23=\"\",L22+1,IF(ISERROR(VLOOKUP(M22,DATA!$F$32:$G$59,2,FALSE)),M22,VLOOKUP(M22,DATA!$F$32:$G$59,2,FALSE))+0.001))","v":1004},null,null,"M_TR_2_APF","Male Teen 2 Raw APF: 16-17",1]
[null,null,"DL",55,null,"DL",25,null,null,null,null,null,null,null,"M_TR_2_AAPF","Male Teen 2 Raw AAPF: 16-17",1]
[null,null,null,"Results - Lbs & Kgs?",null,null,"yes",null,null,null,null,null,null,null,"M_TCR_2_APF","Male Teen 2 Classic Raw APF: 16-17",1]
[null,null,null,null,null,null,null,null,null,null,null,null,null,null,"M_TCR_2_AAPF","Male Teen 2 Classic Raw AAPF: 16-17",1]
[null,null,null,null,null,null,null,null,null,null,null,null,null,null,"M_TEM_2_APF","Male Teen 2 Equipped Multiply APF: 16-17",1]
[null,null,null,"Reset for New Contest",null,null,null,null,null,null,"Best Lifter Coeff",null,null,null,"M_TEM_2_AAPF","Male Teen 2 Equipped Multiply AAPF: 16-17",1]
[null,null,null,null,null,null,null,null,null,null,null,null,null,null,"M_TES_2_APF","Male Teen 2 Equipped Single-Ply APF: 16-17",1]
[null,null,null,null,null,null,null,null,null,null,"Glossbrenner",null,null,null,"M_TES_2_AAPF","Male Teen 2 Equipped Single-Ply AAPF: 16-17",1]
[null,null,null,null,null,null,null,null,null,null,null,null,null,null,"M_TR_3_APF","Male Teen 3 Raw APF: 18-19",1]
[null,null,null,null,null,null,null,null,null,null,null,null,null,null,"M_TR_3_AAPF","Male Teen 3 Raw AAPF: 18-19",1]
[null,null,"Web Upload",null,null,"Disable",null,null,null,null,null,null,null,null,"M_TCR_3_APF","Male Teen 3 Classic Raw APF: 18-19",1]
[null,null,"FTP site",null,null,null,null,null,null,null,null,null,null,null,"M_TCR_3_AAPF","Male Teen 3 Classic Raw AAPF: 18-19",1]
[null,null,"User Name",null,null,null,null,null,null,null,null,null,null,null,"M_TEM_3_APF","Male Teen 3 Equipped Mulitply APF: 18-19",1]
[null,null,"Folder/File Name",null,null,null,null,null,null,null,null,null,null,null,"M_TEM_3_AAPF","Male Teen 3 Equipped Mulitply AAPF: 18-19",1]
[null,null,null,null,null,null,null,null,null,null,null,null,null,null,"M_TES_3_APF","Male Teen 3 Equipped Single-Ply APF: 18-19",1]
[null,null,null,null,"Website",null,null,null,null,null,null,null,null,null,"M_TES_3_AAPF","Male Teen 3 Equipped Single-Ply AAPF: 18-19",1]
[null,null,null,null,null,null,null,null,null,null,null,null,null,null,"M_JR_APF","Male Junior Raw APF: 20-23",1]
[null,null,null,null,null,null,null,null,null,null,null,null,null,null,"M_JR_AAPF","Male Junior Raw AAPF: 20-23",1]
[null,null,"BarLoad Upload",null,null,"Disable",null,null,null,null,null,null,null,null,"M_JCR_APF","Male Junior Classic Raw APF: 20-23",1]
[null,null,"Local Folder",null,"C:\\wamp\\www\\BarLoad",null,null,null,null,null,null,null,null,null,"M_JCR_AAPF","Male Junior Classic Raw AAPF: 20-23",1]
[null,null,"User Name",null,null,null,null,null,null,null,null,null,null,null,"M_JEM_APF","Male Junior Equipped Mulitply APF: 20-23",1]
[null,null,"Folder/File Name",null,"NextLifter_BarLoad",null,null,null,null,null,null,null,null,null,"M_JEM_AAPF","Male Junior Equipped Mulitply AAPF: 20-23",1]
[null,null,null,null,null,null,null,null,null,null,null,null,null,null,"M_JES_APF","Male Junior Equipped Single-Ply APF: 20-23",1]
[null,null,null,null,"Website",null,null,null,null,null,null,null,null,null,"M_JES_AAPF","Male Junior Equipped Single-Ply AAPF: 20-23",1]
[null,null,"C:\\wamp\\www\\BarLoad\\NextLifter_BarLoad.htm",null,null,null,null,null,null,null,null,null,null,null,"M_SR_APF","Male Sub-Master Raw APF: 33-39",1]
[null,null,null,null,null,null,null,null,null,null,null,null,null,null,"M_SR_AAPF","Male Sub-Master Raw AAPF: 33-39",1]
[null,null,null,null,null,null,null,null,null,null,null,null,null,null,"M_SCR_APF","Male Sub-Master Classic Raw APF: 33-39",1]
[null,null,null,null,null,null,null,null,null,null,null,null,null,null,"M_SCR_AAPF","Male Sub-Master Classic Raw AAPF: 33-39",1]
[null,null,null,null,null,null,null,null,null,null,null,null,null,null,"M_SEM_APF","Male Sub-Master Equipped Multiply APF: 33-39",1]
[null,null,null,null,null,null,null,null,null,null,null,null,null,null,"M_SEM_AAPF","Male Sub-Master Equipped Multiply AAPF: 33-39",1]
[null,null,null,null,null,null,null,null,null,null,null,null,null,null,"M_SES_APF","Male Sub-Master Equipped Single-Ply APF: 33-39",1]
[null,null,null,null,null,null,null,null,null,null,null,null,null,null,"M_SES_AAPF","Male Sub-Master Equipped Single-Ply AAPF: 33-39",1]
[null,null,null,null,null,null,null,null,null,null,null,null,null,null,"M_MR_1_APF","Male Master 1 Raw APF: 40-44",1]
[null,null,null,null,null,null,null,null,null,null,null,null,null,null,"M_MR_1_AAPF","Male Master 1 Raw AAPF: 40-44",1]
[null,null,null,null,null,null,null,null,null,null,null,null,null,null,"M_MCR_1_APF","Male Master 1 Classic Raw APF: 40-44",1]
[null,null,null,null,null,null,null,null,null,null,null,null,null,null,"M_MCR_1_AAPF","Male Master 1 Classic Raw AAPF: 40-44",1]
[null,null,null,null,null,null,null,null,null,null,null,null,null,null,"M_MEM_1_APF","Male Master 1 Equipped Multiply APF: 40-44",1]
[null,null,null,null,null,null,null,null,null,null,null,null,null,null,"M_MEM_1_AAPF","Male Master 1 Equipped Multiply AAPF: 40-44",1]
[null,null,null,null,null,null,null,null,null,null,null,null,null,null,"M_MES_1_APF","Male Master 1 Equipped Single-Ply APF: 40-44",1]
[null,null,null,null,null,null,null,null,null,null,null,null,null,null,"M_MES_1_AAPF","Male Master 1 Equipped Single-Ply AAPF: 40-44",1]
[null,null,null,null,null,null,null,null,null,null,null,null,null,null,"M_MR_2_APF","Male Master 2 Raw APF: 45-49",1]
[null,null,null,null,null,null,null,null,null,null,null,null,null,null,"M_MR_2_AAPF","Male Master 2 Raw AAPF: 45-49",1]
[null,null,null,null,null,null,null,null,null,null,null,null,null,null,"M_MCR_2_APF","Male Master 2 Classic Raw APF: 45-49",1]
[null,null,null,null,null,null,null,null,null,null,null,null,null,null,"M_MCR_2_AAPF","Male Master 2 Classic Raw AAPF: 45-49",1]
[null,null,null,null,null,null,null,null,null,null,null,null,null,null,"M_MEM_2_APF","Male Master 2 Equipped Mulitply APF: 45-49",1]
[null,null,null,null,null,null,null,null,null,null,null,null,null,null,"M_MEM_2_AAPF","Male Master 2 Equipped Multiply AAPF: 45-49",1]
[null,null,null,null,null,null,null,null,null,null,null,null,null,null,"M_MES_2_APF","Male Master 2 Equipped Single-Ply APF: 45-49",1]
[null,null,null,null,null,null,null,null,null,null,null,null,null,null,"M_MES_2_AAPF","Male Master 2 Equipped Sinlge-Ply AAPF: 45-49",1]
[null,null,null,null,null,null,null,null,null,null,null,null,null,null,"M_MR_3_APF","Male Master 3 Raw APF: 50-54",1]
[null,null,null,null,null,null,null,null,null,null,null,null,null,null,"M_MR_3_AAPF","Male Master 3 Raw AAPF: 50-54",1]
[null,null,null,null,null,null,null,null,null,null,null,null,null,null,"M_MCR_3_APF","Male Master 3 Classic Raw APF: 50-54",1]
[null,null,null,null,null,null,null,null,null,null,null,null,null,null,"M_MCR_3_AAPF","Male Master 3 Classic Raw AAPF: 50-54",1]
[null,null,null,null,null,null,null,null,null,null,null,null,null,null,"M_MEM_3_APF","Male Master 3 Equipped Mulitply APF: 50-54",1]
[null,null,null,null,null,null,null,null,null,null,null,null,null,null,"M_MEM_3_AAPF","Male Master 3 Equipped Multiply AAPF: 50-54",1]
[null,null,null,null,null,null,null,null,null,null,null,null,null,null,"M_MES_3_APF","Male Master 3 Equipped Single-Ply APF: 50-54",1]
[null,null,null,null,null,null,null,null,null,null,null,null,null,null,"M_MES_3_AAPF","Male Master 3 Equipped Single-Ply AAPF: 50-54",1]
[null,null,null,null,null,null,null,null,null,null,null,null,null,null,"M_MR_4_APF","Male Master 4 Raw APF: 55-59",1]
[null,null,null,null,null,null,null,null,null,null,null,null,null,null,"M_MR_4_AAPF","Male Master 4 Raw AAPF: 55-59",1]
[null,null,null,null,null,null,null,null,null,null,null,null,null,null,"M_MCR_4_APF","Male Master 4 Classic Raw APF: 55-59",1]
[null,null,null,null,null,null,null,null,null,null,null,null,null,null,"M_MCR_4_AAPF","Male Master 4 Classic Raw AAPF: 55-59",1]
[null,null,null,null,null,null,null,null,null,null,null,null,null,null,"M_MEM_4_APF","Male Master 4 Equipped Mulitply APF: 55-59",1]
[null,null,null,null,null,null,null,null,null,null,null,null,null,null,"M_MEM_4_AAPF","Male Master 4 Equipped Multiply AAPF: 55-59",1]
[null,null,null,null,null,null,null,null,null,null,null,null,null,null,"M_MES_4_APF","Male Master 4 Equipped Single-Ply APF: 55-59",1]
[null,null,null,null,null,null,null,null,null,null,null,null,null,null,"M_MES_4_AAPF","Male Master 4 Equipped Single-Ply AAPF: 55-59",1]
[null,null,null,null,null,null,null,null,null,null,null,null,null,null,"M_MR_5_APF","Male Master 5 Raw APF: 60-64",1]
[null,null,null,null,null,null,null,null,null,null,null,null,null,null,"M_MR_5_AAPF","Male Master 5 Raw AAPF: 60-64",1]
[null,null,null,null,null,null,null,null,null,null,null,null,null,null,"M_MCR_5_APF","Male Master 5 Classic Raw APF: 60-64",1]
[null,null,null,null,null,null,null,null,null,null,null,null,null,null,"M_MCR_5_AAPF","Male Master 5 Classic Raw AAPF: 60-64",1]
[null,null,null,null,null,null,null,null,null,null,null,null,null,null,"M_MEM_5_APF","Male Master 5 Equipped Multiply APF: 60-64",1]
[null,null,null,null,null,null,null,null,null,null,null,null,null,null,"M_MEM_5_AAPF","Male Master 5 Equipped Multiply AAPF: 60-64",1]
[null,null,null,null,null,null,null,null,null,null,null,null,null,null,"M_MES_5_APF","Male Master 5 Equipped Single-Ply APF: 60-64",1]
[null,null,null,null,null,null,null,null,null,null,null,null,null,null,"M_MES_5_AAPF","Male Master 5 Equipped Single-Ply AAPF: 60-64",1]
[null,null,null,null,null,null,null,null,null,null,null,null,null,null,"M_MR_6_APF","Male Master 6 Raw APF: 65-69",1]
[null,null,null,null,null,null,null,null,null,null,null,null,null,null,"M_MR_6_AAPF","Male Master 6 Raw AAPF: 65-69",1]
[null,null,null,null,null,null,null,null,null,null,null,null,null,null,"M_MCR_6_APF","Male Master 6 Classic Raw APF: 65-69",1]
[null,null,null,null,null,null,null,null,null,null,null,null,null,null,"M_MCR_6_AAPF","Male Master 6 Classic Raw AAPF: 65-69",1]
[null,null,null,null,null,null,null,null,null,null,null,null,null,null,"M_MEM_6_APF","Male Master 6 Equipped Multiply APF: 65-69",1]
[null,null,null,null,null,null,null,null,null,null,null,null,null,null,"M_MEM_6_AAPF","Male Master 6 Equipped Multiply AAPF: 65-69",1]
[null,null,null,null,null,null,null,null,null,null,null,null,null,null,"M_MES_6_APF","Male Master 6 Equipped Single-Ply APF: 65-69",1]
[null,null,null,null,null,null,null,null,null,null,null,null,null,null,"M_MES_6_AAPF","Male Master 6 Equipped Single-Ply AAPF: 65-69",1]
[null,null,null,null,null,null,null,null,null,null,null,null,null,null,"M_MR_7_APF","Male Master 7 Raw APF: 70-74",1]
[null,null,null,null,null,null,null,null,null,null,null,null,null,null,"M_MR_7_AAPF","Male Master 7 Raw AAPF: 70-74",1]
[null,null,null,null,null,null,null,null,null,null,null,null,null,null,"M_MCR_7_APF","Male Master 7 Classic Raw APF: 70-74",1]
[null,null,null,null,null,null,null,null,null,null,null,null,null,null,"M_MCR_7_AAPF","Male Master 7 Classic Raw AAPF: 70-74",1]
[null,null,null,null,null,null,null,null,null,null,null,null,null,null,"M_MEM_7_APF","Male Master 7 Equipped Multiply APF: 70-74",1]
[null,null,null,null,null,null,null,null,null,null,null,null,null,null,"M_MEM_7_AAPF","Male Master 7 Equipped Multiply AAPF: 70-74",1]
[null,null,null,null,null,null,null,null,null,null,null,null,null,null,"M_MES_7_APF","Male Master 7 Equipped Single-Ply APF: 70-74",1]
[null,null,null,null,null,null,null,null,null,null,null,null,null,null,"M_MES_7_AAPF","Male Master 7 Equipped Single-Ply AAPF: 70-74",1]
[null,null,null,null,null,null,null,null,null,null,null,null,null,null,"M_MR_8_APF","Male Master 8 Raw APF: 75-79",1]
[null,null,null,null,null,null,null,null,null,null,null,null,null,null,"M_MR_8_AAPF","Male Master 8 Raw AAPF: 75-79",1]
[null,null,null,null,null,null,null,null,null,null,null,null,null,null,"M_MCR_8_APF","Male Master 8 Classic Raw APF: 75-79",1]
[null,null,null,null,null,null,null,null,null,null,null,null,null,null,"M_MCR_8_AAPF","Male Master 8 Classic Raw AAPF: 75-79",1]
[null,null,null,null,null,null,null,null,null,null,null,null,null,null,"M_MEM_8_APF","Male Master 8 Equipped Mulitply APF: 75-79",1]
[null,null,null,null,null,null,null,null,null,null,null,null,null,null,"M_MEM_8_AAPF","Male Master 8 Equipped Multiply AAPF: 75-79",1]
[null,null,null,null,null,null,null,null,null,null,null,null,null,null,"M_MES_8_APF","Male Master 8 Equipped Single-Ply  APF: 75-79",1]
[null,null,null,null,null,null,null,null,null,null,null,null,null,null,"M_MES_8_AAPF","Male Master 8 Equipped Single-Ply AAPF: 75-79",1]
[null,null,null,null,null,null,null,null,null,null,null,null,null,null,"M_MR_9_APF","Male Master 9 Raw APF: 80+",1]
[null,null,null,null,null,null,null,null,null,null,null,null,null,null,"M_MR_9_AAPF","Male Master 9 Raw AAPF: 80+",1]
[null,null,null,null,null,null,null,null,null,null,null,null,null,null,"M_MCR_9_APF","Male Master 9 Classic Raw APF: 80+",1]
[null,null,null,null,null,null,null,null,null,null,null,null,null,null,"M_MCR_9_AAPF","Male Master 9 Classic Raw AAPF: 80+",1]
[null,null,null,null,null,null,null,null,null,null,null,null,null,null,"M_MEM_9_APF","Male Master 9 Equipped Multiply APF: 80+",1]
[null,null,null,null,null,null,null,null,null,null,null,null,null,null,"M_MEM_9_AAPF","Male Master 9 Equipped Multiply AAPF: 80+",1]
[null,null,null,null,null,null,null,null,null,null,null,null,null,null,"M_MES_9_APF","Male Master 9 Equipped Single-Ply APF: 80+",1]
[null,null,null,null,null,null,null,null,null,null,null,null,null,null,"M_MES_9_AAPF","Male Master 9 Equipped Single-Ply AAPF: 80+",1]
[null,null,null,null,null,null,null,null,null,null,null,null,null,null,"F_OR_APF","Female Open Raw APF",1]
[null,null,null,null,null,null,null,null,null,null,null,null,null,null,"F_OR_AAPF","Female Open Raw AAPF",1]
[null,null,null,null,null,null,null,null,null,null,null,null,null,null,"F_OCR_APF","Female Open Classic Raw APF",1]
[null,null,null,null,null,null,null,null,null,null,null,null,null,null,"F_OCR_AAPF","Female Open Classic Raw AAPF",1]
[null,null,null,null,null,null,null,null,null,null,null,null,null,null,"F_OEM_APF","Female Open Equipped Multiply APF",1]
[null,null,null,null,null,null,null,null,null,null,null,null,null,null,"F_OEM_AAPF","Female Open Equipped Multiply AAPF",1]
[null,null,null,null,null,null,null,null,null,null,null,null,null,null,"F_OES_APF","Female Open Equipped Single-Ply APF",1]
[null,null,null,null,null,null,null,null,null,null,null,null,null,null,"F_OES_AAPF","Female Open Equipped Single-Ply AAPF",1]
[null,null,null,null,null,null,null,null,null,null,null,null,null,null,"F_TR_1_APF","Female Teen 1 Raw APF: 13-15",1]
[null,null,null,null,null,null,null,null,null,null,null,null,null,null,"F_TR_1_AAPF","Female Teen 1 Raw AAPF: 13-15",1]
[null,null,null,null,null,null,null,null,null,null,null,null,null,null,"F_TCR_1_APF","Female Teen 1 Classic Raw APF: 13-15",1]
[null,null,null,null,null,null,null,null,null,null,null,null,null,null,"F_TCR_1_AAPF","Female Teen 1 Classic Raw AAPF: 13-15",1]
[null,null,null,null,null,null,null,null,null,null,null,null,null,null,"F_TEM_1_APF","Female Teen 1 Equipped Multiply APF: 13-15",1]
[null,null,null,null,null,null,null,null,null,null,null,null,null,null,"F_TEM_1_AAPF","Female Teen 1 Equipped Multiply AAPF: 13-15",1]
[null,null,null,null,null,null,null,null,null,null,null,null,null,null,"F_TES_1_APF","Female Teen 1 Equipped Single-Ply APF: 13-15",1]
[null,null,null,null,null,null,null,null,null,null,null,null,null,null,"F_TES_1_AAPF","Female Teen 1 Equipped Single-PlyAAPF: 13-15",1]
[null,null,null,null,null,null,null,null,null,null,null,null,null,null,"F_TR_2_APF","Female Teen 2 Raw APF: 16-17",1]
[null,null,null,null,null,null,null,null,null,null,null,null,null,null,"F_TR_2_AAPF","Female Teen 2 Raw AAPF: 16-17",1]
[null,null,null,null,null,null,null,null,null,null,null,null,null,null,"F_TCR_2_APF","Female Teen 2 Classic Raw APF: 16-17",1]
[null,null,null,null,null,null,null,null,null,null,null,null,null,null,"F_TCR_2_AAPF","Female Teen 2 Classic Raw AAPF: 16-17",1]
[null,null,null,null,null,null,null,null,null,null,null,null,null,null,"F_TEM_2_APF","Female Teen 2 Equipped Multiply APF: 16-17",1]
[null,null,null,null,null,null,null,null,null,null,null,null,null,null,"F_TEM_2_AAPF","Female Teen 2 Equipped Multiply AAPF: 16-17",1]
[null,null,null,null,null,null,null,null,null,null,null,null,null,null,"F_TES_2_APF","Female Teen 2 Equipped Single-Ply APF: 16-17",1]
[null,null,null,null,null,null,null,null,null,null,null,null,null,null,"F_TES_2_AAPF","Female Teen 2 Equipped Single-Ply AAPF: 16-17",1]
[null,null,null,null,null,null,null,null,null,null,null,null,null,null,"F_TR_3_APF","Female Teen 3 Raw APF: 18-19",1]
[null,null,null,null,null,null,null,null,null,null,null,null,null,null,"F_TR_3_AAPF","Female Teen 3 Raw AAPF: 18-19",1]
[null,null,null,null,null,null,null,null,null,null,null,null,null,null,"F_TCR_3_APF","Female Teen 3 Classic Raw APF: 18-19",1]
[null,null,null,null,null,null,null,null,null,null,null,null,null,null,"F_TCR_3_AAPF","Female Teen 3 Classic Raw AAPF: 18-19",1]
[null,null,null,null,null,null,null,null,null,null,null,null,null,null,"F_TEM_3_APF","Female Teen 3 Equipped Mulitply APF: 18-19",1]
[null,null,null,null,null,null,null,null,null,null,null,null,null,null,"F_TEM_3_AAPF","Female Teen 3 Equipped Mulitply AAPF: 18-19",1]
[null,null,null,null,null,null,null,null,null,null,null,null,null,null,"F_TES_3_APF","Female Teen 3 Equipped Single-Ply APF: 18-19",1]
[null,null,null,null,null,null,null,null,null,null,null,null,null,null,"F_TES_3_AAPF","Female Teen 3 Equipped Single-Ply AAPF: 18-19",1]
[null,null,null,null,null,null,null,null,null,null,null,null,null,null,"F_JR_APF","Female Junior Raw APF: 20-23",1]
[null,null,null,null,null,null,null,null,null,null,null,null,null,null,"F_JR_AAPF","Female Junior Raw AAPF: 20-23",1]
[null,null,null,null,null,null,null,null,null,null,null,null,null,null,"F_JCR_APF","Female Junior Classic Raw APF: 20-23",1]
[null,null,null,null,null,null,null,null,null,null,null,null,null,null,"F_JCR_AAPF","Female Junior Classic Raw AAPF: 20-23",1]
[null,null,null,null,null,null,null,null,null,null,null,null,null,null,"F_JEM_APF","Female Junior Equipped Mulitply APF: 20-23",1]
[null,null,null,null,null,null,null,null,null,null,null,null,null,null,"F_JEM_AAPF","Female Junior Equipped Mulitply AAPF: 20-23",1]
[null,null,null,null,null,null,null,null,null,null,null,null,null,null,"F_JES_APF","Female Junior Equipped Single-Ply APF: 20-23",1]
[null,null,null,null,null,null,null,null,null,null,null,null,null,null,"F_JES_AAPF","Female Junior Equipped Single-Ply AAPF: 20-23",1]
[null,null,null,null,null,null,null,null,null,null,null,null,null,null,"F_SR_APF","Female Sub-Master Raw APF: 33-39",1]
[null,null,null,null,null,null,null,null,null,null,null,null,null,null,"F_SR_AAPF","Female Sub-Master Raw AAPF: 33-39",1]
[null,null,null,null,null,null,null,null,null,null,null,null,null,null,"F_SCR_APF","Female Sub-Master Classic Raw APF: 33-39",1]
[null,null,null,null,null,null,null,null,null,null,null,null,null,null,"F_SCR_AAPF","Female Sub-Master Classic Raw AAPF: 33-39",1]
[null,null,null,null,null,null,null,null,null,null,null,null,null,null,"F_SEM_APF","Female Sub-Master Equipped Multiply APF: 33-39",1]
[null,null,null,null,null,null,null,null,null,null,null,null,null,null,"F_SEM_AAPF","Female Sub-Master Equipped Multiply AAPF: 33-39",1]
[null,null,null,null,null,null,null,null,null,null,null,null,null,null,"F_SES_APF","Female Sub-Master Equipped Single-Ply APF: 33-39",1]
[null,null,null,null,null,null,null,null,null,null,null,null,null,null,"F_SES_AAPF","Female Sub-Master Equipped Single-Ply AAPF: 33-39",1]
[null,null,null,null,null,null,null,null,null,null,null,null,null,null,"F_MR_1_APF","Female Master 1 Raw APF: 40-44",1]
[null,null,null,null,null,null,null,null,null,null,null,null,null,null,"F_MR_1_AAPF","Female Master 1 Raw AAPF: 40-44",1]
[null,null,null,null,null,null,null,null,null,null,null,null,null,null,"F_MCR_1_APF","Female Master 1 Classic Raw APF: 40-44",1]
[null,null,null,null,null,null,null,null,null,null,null,null,null,null,"F_MCR_1_AAPF","Female Master 1 Classic Raw AAPF: 40-44",1]
[null,null,null,null,null,null,null,null,null,null,null,null,null,null,"F_MEM_1_APF","Female Master 1 Equipped Multiply APF: 40-44",1]
[null,null,null,null,null,null,null,null,null,null,null,null,null,null,"F_MEM_1_AAPF","Female Master 1 Equipped Multiply AAPF: 40-44",1]
[null,null,null,null,null,null,null,null,null,null,null,null,null,null,"F_MES_1_APF","Female Master 1 Equipped Single-Ply APF: 40-44",1]
[null,null,null,null,null,null,null,null,null,null,null,null,null,null,"F_MES_1_AAPF","Female Master 1 Equipped Single-Ply AAPF: 40-44",1]
[null,null,null,null,null,null,null,null,null,null,null,null,null,null,"F_MR_2_APF","Female Master 2 Raw APF: 45-49",1]
[null,null,null,null,null,null,null,null,null,null,null,null,null,null,"F_MR_2_AAPF","Female Master 2 Raw AAPF: 45-49",1]
[null,null,null,null,null,null,null,null,null,null,null,null,null,null,"F_MCR_2_APF","Female Master 2 Classic Raw APF: 45-49",1]
[null,null,null,null,null,null,null,null,null,null,null,null,null,null,"F_MCR_2_AAPF","Female Master 2 Classic Raw AAPF: 45-49",1]
[null,null,null,null,null,null,null,null,null,null,null,null,null,null,"F_MEM_2_APF","Female Master 2 Equipped Mulitply APF: 45-49",1]
[null,null,null,null,null,null,null,null,null,null,null,null,null,null,"F_MEM_2_AAPF","Female Master 2 Equipped Multiply AAPF: 45-49",1]
[null,null,null,null,null,null,null,null,null,null,null,null,null,null,"F_MES_2_APF","Female Master 2 Equipped Single-Ply APF: 45-49",1]
[null,null,null,null,null,null,null,null,null,null,null,null,null,null,"F_MES_2_AAPF","Female Master 2 Equipped Sinlge-Ply AAPF: 45-49",1]
[null,null,null,null,null,null,null,null,null,null,null,null,null,null,"F_MR_3_APF","Female Master 3 Raw APF: 50-54",1]
[null,null,null,null,null,null,null,null,null,null,null,null,null,null,"F_MR_3_AAPF","Female Master 3 Raw AAPF: 50-54",1]
[null,null,null,null,null,null,null,null,null,null,null,null,null,null,"F_MCR_3_APF","Female Master 3 Classic Raw APF: 50-54",1]
[null,null,null,null,null,null,null,null,null,null,null,null,null,null,"F_MCR_3_AAPF","Female Master 3 Classic Raw AAPF: 50-54",1]
[null,null,null,null,null,null,null,null,null,null,null,null,null,null,"F_MEM_3_APF","Female Master 3 Equipped Mulitply APF: 50-54",1]
[null,null,null,null,null,null,null,null,null,null,null,null,null,null,"F_MEM_3_AAPF","Female Master 3 Equipped Multiply AAPF: 50-54",1]
[null,null,null,null,null,null,null,null,null,null,null,null,null,null,"F_MES_3_APF","Female Master 3 Equipped Single-Ply APF: 50-54",1]
[null,null,null,null,null,null,null,null,null,null,null,null,null,null,"F_MES_3_AAPF","Female Master 3 Equipped Single-Ply AAPF: 50-54",1]
[null,null,null,null,null,null,null,null,null,null,null,null,null,null,"F_MR_4_APF","Female Master 4 Raw APF: 55-59",1]
[null,null,null,null,null,null,null,null,null,null,null,null,null,null,"F_MR_4_AAPF","Female Master 4 Raw AAPF: 55-59",1]
[null,null,null,null,null,null,null,null,null,null,null,null,null,null,"F_MCR_4_APF","Female Master 4 Classic Raw APF: 55-59",1]
[null,null,null,null,null,null,null,null,null,null,null,null,null,null,"F_MCR_4_AAPF","Female Master 4 Classic Raw AAPF: 55-59",1]
[null,null,null,null,null,null,null,null,null,null,null,null,null,null,"F_MEM_4_APF","Female Master 4 Equipped Mulitply APF: 55-59",1]
[null,null,null,null,null,null,null,null,null,null,null,null,null,null,"F_MEM_4_AAPF","Female Master 4 Equipped Multiply AAPF: 55-59",1]
[null,null,null,null,null,null,null,null,null,null,null,null,null,null,"F_MES_4_APF","Female Master 4 Equipped Single-Ply APF: 55-59",1]
[null,null,null,null,null,null,null,null,null,null,null,null,null,null,"F_MES_4_AAPF","Female Master 4 Equipped Single-Ply AAPF: 55-59",1]
[null,null,null,null,null,null,null,null,null,null,null,null,null,null,"F_MR_5_APF","Female Master 5 Raw APF: 60-64",1]
[null,null,null,null,null,null,null,null,null,null,null,null,null,null,"F_MR_5_AAPF","Female Master 5 Raw AAPF: 60-64",1]
[null,null,null,null,null,null,null,null,null,null,null,null,null,null,"F_MCR_5_APF","Female Master 5 Classic Raw APF: 60-64",1]
[null,null,null,null,null,null,null,null,null,null,null,null,null,null,"F_MCR_5_AAPF","Female Master 5 Classic Raw AAPF: 60-64",1]
[null,null,null,null,null,null,null,null,null,null,null,null,null,null,"F_MEM_5_APF","Female Master 5 Equipped Multiply APF: 60-64",1]
[null,null,null,null,null,null,null,null,null,null,null,null,null,null,"F_MEM_5_AAPF","Female Master 5 Equipped Multiply AAPF: 60-64",1]
[null,null,null,null,null,null,null,null,null,null,null,null,null,null,"F_MES_5_APF","Female Master 5 Equipped Single-Ply APF: 60-64",1]
[null,null,null,null,null,null,null,null,null,null,null,null,null,null,"F_MES_5_AAPF","Female Master 5 Equipped Single-Ply AAPF: 60-64",1]
[null,null,null,null,null,null,null,null,null,null,null,null,null,null,"F_MR_6_APF","Female Master 6 Raw APF: 65-69",1]
[null,null,null,null,null,null,null,null,null,null,null,null,null,null,"F_MR_6_AAPF","Female Master 6 Raw AAPF: 65-69",1]
[null,null,null,null,null,null,null,null,null,null,null,null,null,null,"F_MCR_6_APF","Female Master 6 Classic Raw APF: 65-69",1]
[null,null,null,null,null,null,null,null,null,null,null,null,null,null,"F_MCR_6_AAPF","Female Master 6 Classic Raw AAPF: 65-69",1]
[null,null,null,null,null,null,null,null,null,null,null,null,null,null,"F_MEM_6_APF","Female Master 6 Equipped Multiply APF: 65-69",1]
[null,null,null,null,null,null,null,null,null,null,null,null,null,null,"F_MEM_6_AAPF","Female Master 6 Equipped Multiply AAPF: 65-69",1]
[null,null,null,null,null,null,null,null,null,null,null,null,null,null,"F_MES_6_APF","Female Master 6 Equipped Single-Ply APF: 65-69",1]
[null,null,null,null,null,null,null,null,null,null,null,null,null,null,"F_MES_6_AAPF","Female Master 6 Equipped Single-Ply AAPF: 65-69",1]
[null,null,null,null,null,null,null,null,null,null,null,null,null,null,"F_MR_7_APF","Female Master 7 Raw APF: 70-74",1]
[null,null,null,null,null,null,null,null,null,null,null,null,null,null,"F_MR_7_AAPF","Female Master 7 Raw AAPF: 70-74",1]
[null,null,null,null,null,null,null,null,null,null,null,null,null,null,"F_MCR_7_APF","Female Master 7 Classic Raw APF: 70-74",1]
[null,null,null,null,null,null,null,null,null,null,null,null,null,null,"F_MCR_7_AAPF","Female Master 7 Classic Raw AAPF: 70-74",1]
[null,null,null,null,null,null,null,null,null,null,null,null,null,null,"F_MEM_7_APF","Female Master 7 Equipped Multiply APF: 70-74",1]
[null,null,null,null,null,null,null,null,null,null,null,null,null,null,"F_MEM_7_AAPF","Female Master 7 Equipped Multiply AAPF: 70-74",1]
[null,null,null,null,null,null,null,null,null,null,null,null,null,null,"F_MES_7_APF","Female Master 7 Equipped Single-Ply APF: 70-74",1]
[null,null,null,null,null,null,null,null,null,null,null,null,null,null,"F_MES_7_AAPF","Female Master 7 Equipped Single-Ply AAPF: 70-74",1]
[null,null,null,null,null,null,null,null,null,null,null,null,null,null,"F_MR_8_APF","Female Master 8 Raw APF: 75-79",1]
[null,null,null,null,null,null,null,null,null,null,null,null,null,null,"F_MR_8_AAPF","Female Master 8 Raw AAPF: 75-79",1]
[null,null,null,null,null,null,null,null,null,null,null,null,null,null,"F_MCR_8_APF","Female Master 8 Classic Raw APF: 75-79",1]
[null,null,null,null,null,null,null,null,null,null,null,null,null,null,"F_MCR_8_AAPF","Female Master 8 Classic Raw AAPF: 75-79",1]
[null,null,null,null,null,null,null,null,null,null,null,null,null,null,"F_MEM_8_APF","Female Master 8 Equipped Mulitply APF: 75-79",1]
[null,null,null,null,null,null,null,null,null,null,null,null,null,null,"F_MEM_8_AAPF","Female Master 8 Equipped Multiply AAPF: 75-79",1]
[null,null,null,null,null,null,null,null,null,null,null,null,null,null,"F_MES_8_APF","Female Master 8 Equipped Single-Ply  APF: 75-79",1]
[null,null,null,null,null,null,null,null,null,null,null,null,null,null,"F_MES_8_AAPF","Female Master 8 Equipped Single-Ply AAPF: 75-79",1]
[null,null,null,null,null,null,null,null,null,null,null,null,null,null,"F_MR_9_APF","Female Master 9 Raw APF: 80+",1]
[null,null,null,null,null,null,null,null,null,null,null,null,null,null,"F_MR_9_AAPF","Female Master 9 Raw AAPF: 80+",1]
[null,null,null,null,null,null,null,null,null,null,null,null,null,null,"F_MCR_9_APF","Female Master 9 Classic Raw APF: 80+",1]
[null,null,null,null,null,null,null,null,null,null,null,null,null,null,"F_MCR_9_AAPF","Female Master 9 Classic Raw AAPF: 80+",1]
[null,null,null,null,null,null,null,null,null,null,null,null,null,null,"F_MEM_9_APF","Female Master 9 Equipped Multiply APF: 80+",1]
[null,null,null,null,null,null,null,null,null,null,null,null,null,null,"F_MEM_9_AAPF","Female Master 9 Equipped Multiply AAPF: 80+",1]
[null,null,null,null,null,null,null,null,null,null,null,null,null,null,"F_MES_9_APF","Female Master 9 Equipped Single-Ply APF: 80+",1]
[null,null,null,null,null,null,null,null,null,null,null,null,null,null,"F_MES_9_AAPF","Female Master 9 Equipped Single-Ply AAPF: 80+",1]

{"sheet":"Weigh-in","index":1,"n_rows":54,"n_cols":101,"rows_kept":54,"cut":false,"hidden":false,"merged":[]}
[null,null,null,null,null,null,null,null,null,null,null,null,null,null,null,null,null,null,null,null,null,null,null,null,null,null,null,null,null,null,null,null,null,null,null,null,null,null,null,null,null,null,null,null,null,null,null,null,{"$f":"CONCATENATE(\"Setup!O7:O\",COUNTA(Setup!O:O)+3)","v":"Setup!O7:O246"},null,null,"Powerlifting (3 lift meet)","Bench Press Only","Squat Only","Deadlift Only","Push Pull (Bench & Deadlift)",null,null,null,null,null,null,null,null,null,null,null,null,null,null,null,null,null,null,null,null,null,null,1,2,23,1]
[null,"Name","Age","Div",{"$f":"Setup!K6","v":"BWt (Kg)"},"WtCls (Kg)","Wilks Coeff","Lot #","RH Sq"," Squat  1"," Squat  2"," Squat  3"," Squat  4","Best Squat","RH BP","  Bench 1","Bench 2","Bench 3","Bench  4","Best Bench","Sub Total","Deadlift 1","Deadlift 2","Deadlift 3","Deadlift 4","Best Deadlift",null,"Coeff Score","Age  & Coeff","Place code",null,"Pl-Div-WtCl","Team Pts","Event check","sort #","lbs/kg",null,null,null,"scoring value","rank",-1,null,null,null,null,null,null,null,null,null,null,null,null,null,null,null,null,null,null,null,null,null,null,null,null,null,null,null,null,null,null,null,null,null,null,null,null,34,34,33,31,null,"status"," Squat  1"," Squat  2"," Squat  3"," Squat  4","Best Squat","RH BP","Bench 1","Bench 2","Bench 3","Bench  4","Best Bench","Sub Total","Deadlift 1","Deadlift 2","Deadlift 3","Deadlift 4","Best Deadlift"]
[null,"Nora Langdon",null,"F_MR_7_AAPF",90,null,null,null,null,null,null,null,null,null,null,72.5,82.5,92.5,null,92.5,null,null,null,null,null,null,null,134.69399999999999,0,1,"1-","F_OR_AAPF",3]
[null,"Amy Lindsey",null,"F_MR_2_AAPF",82.5,null,null,null,null,null,null,null,null,null,null,52.5,57.5,62.5,null,62.5,null,null,null,null,null,null,null,106.50149999999999,0,1,"1-","F_OR_AAPF",3]
[null,"Jill Jansen",null,"F_MR_2_AAPF",67.5,null,null,null,null,null,null,null,null,null,null,60,-62.5,-62.5,null,60,null,null,null,null,null,null,null,117.5005,0,1,"2-","F_OR_AAPF",3]
[null,"Kitty Wood",null,"F_MR_2_AAPF",56,null,null,null,null,null,null,null,null,null,null,37.5,40,42.5,null,42.5,null,null,null,null,null,null,null,99.455500000000001,0,1,"3-","F_OR_AAPF",3]
[null,"Renee Laffitte",null,"F_MR_1_APF",90,null,null,null,null,null,null,null,null,null,null,60,70,77.5,null,77.5,null,null,null,null,null,null,null,127.211,0,1,"1-","F_OR_APF",3]
[null,"Kayla Richie",null,"F_SR_AAPF",82.5,null,null,null,null,null,null,null,null,null,null,87.5,-95,95,null,95,null,null,null,null,null,null,null,165.66900000000001,0,1,"1-","F_OR_APF",3]
[null,"Chloe Darnell",null,"F_OR_AAPF",90,null,null,null,null,null,null,null,null,null,null,-52.5,55,60,null,60,null,null,null,null,null,null,null,97.278999999999996,0,1,"1-","F_OR_APF",3]
[null,"Kelli Holschuh",null,"F_OR_AAPF",75,null,null,null,null,null,null,null,null,null,null,57.5,-65,-65,null,567.5,null,null,null,null,null,null,null,104.7,0,1,"2-","M_MES_5_AAPF",3]
[null,"Jenna Wandtke",null,"F_OR_AAPF",90,null,null,null,null,null,null,null,null,null,null,52.5,-57.5,57.5,null,57.5,null,null,null,null,null,null,null,93.537499999999994,0,1,"3-","M_MR_5_APF",3]
[null,"Keali Heileman",null,"F_OR_AAPF",82.5,null,null,null,null,null,null,null,null,null,null,50,55,-60,null,55,null,null,null,null,null,null,null,94.668000000000006,0,1,"4-","M_MR_4_AAPF",3]
[null,"Amanda Barr",null,"F_OR_AAPF",75,null,null,null,null,null,null,null,null,null,null,47.5,50,52.5,null,52.5,"Women",null,null,null,null,null,null,97.922499999999999,0,1,"5-","M_MR_4_APF",3]
[null,"Christine Steinmetz",null,"F_OR_AAPF",82.5,null,null,null,null,null,null,null,null,null,null,47.5,-50,-50,null,47.5,44,null,null,null,null,null,null,82.834500000000006,0,1,"6-","M_MR_3_AAPF",3]
[null,"Brianna Maisen",null,"F_OR_AAPF",56,null,null,null,null,null,null,null,null,null,null,40,42.5,-45,null,42.5,48,null,null,null,null,null,null,94.221000000000004,0,1,"7-","M_MR_3_AAPF",3]
[null,"Johanna Heslop",null,"F_OR_APF",75,null,null,null,null,null,null,null,null,null,null,55,60,-65,null,60,52,null,null,null,null,null,null,113.07599999999999,0,1,"1-","M_MR_2_AAPF",3]
[null,"Lori Fowler",null,"F_OR_APF",67.5,null,null,null,null,null,null,null,null,null,null,37.5,40,45,null,45,56,null,null,null,null,null,null,90.385000000000005,0,1,"2-","M_MEM_1_APF",3]
[null,"Katherine Rothley",null,"F_OR_APF",75,null,null,null,null,null,null,null,null,null,null,42.5,45,"----",null,45,60,null,null,null,null,null,null,79.569999999999993,0,1,"3-","M_MEM_1_APF",3]
[null,"Jim Wetenhall",null,"M_MES_5_AAPF",140,null,null,null,null,null,null,null,null,null,null,157.5,167.5,170,null,170,67.5,null,null,null,null,null,null,199.25624999999999,0,1,"1-","M_MR_1_AAPF",3]
[null,"Jim Harris",null,"M_MR_5_APF",75,null,null,null,null,null,null,null,null,null,null,127.5,137.5,-140,null,137.5,75,null,null,null,null,null,null,206.97,0,1,"1-","M_MR_1_APF",3]
[null,"Jeffery Ellis",null,"M_MR_4_AAPF",90,null,null,null,null,null,null,null,null,null,null,125,132.5,-135,null,132.5,82.5,null,null,null,null,null,null,177.654,0,1,"1-","M_SR_AAPF",3]
[null,"Wally Stamper",null,"M_MR_4_APF",125,null,null,null,null,null,null,null,null,null,null,175,185,-190,null,185,90,null,null,null,null,null,null,221.02875,0,1,"1-","M_SR_AAPF",3]
[null,"Anthony Boston",null,"M_MR_3_AAPF",110,null,null,null,null,null,null,null,null,null,null,215,227.5,"---",null,227.5,"SHW",null,null,null,null,null,null,281.3,0,1,"1-","M_SR_APF",3]
[null,"Anthony Albo",null,"M_MR_3_AAPF",110,null,null,null,null,null,null,null,null,null,null,185,190,192.5,null,192.5,null,null,null,null,null,null,null,239.16874999999999,0,1,"1-","M_JR_AAPF",3]
[null,"Ken Dilg",null,"M_MR_2_AAPF",90,null,null,null,null,null,null,null,null,null,null,132.5,140,145,null,145,null,null,null,null,null,null,null,196.03200000000001,0,1,"1-","M_TR_3_AAPF",3]
[null,"Patrick Mitchell",null,"M_MEM_1_APF",125,null,null,null,null,null,null,null,null,null,null,-210,-210,-210,null,0,null,null,null,null,null,null,null,0,0,1,0,"M_TR_2_AAPF",0]
[null,"Matthew Ogurek",null,"M_MEM_1_APF",110,null,null,null,null,null,null,null,null,null,null,227.5,242.5,255,null,255,null,null,null,null,null,null,null,315.14,0,1,"1-","M_TR_2_AAPF",3]
[null,"Chris Lindsey",null,"M_MR_1_AAPF",60,null,null,null,null,null,null,null,null,null,null,82.5,90,95,null,95,null,null,null,null,null,null,null,164.07300000000001,0,1,"1-","M_TR_2_AAPF",3]
[null,"Lary Brendel",null,"M_MR_1_APF",125,null,null,null,null,null,null,null,null,null,null,217.5,227.5,-235,null,227.5,null,null,null,null,null,null,null,272.875,0,1,"1-","M_OEM_APF",3]
[null,"Brian Rausch",null,"M_SR_AAPF",140,null,null,null,null,null,null,null,null,null,null,177.5,187.5,192.5,null,192.5,null,null,null,null,null,null,null,223.167,0,1,"1-","M_OR_AAPF",3]
[null,"Edward King",null,"M_SR_AAPF",140,null,null,null,null,null,null,null,null,null,null,170,-185,-185,null,170,null,null,null,null,null,null,null,199.25624999999999,0,1,"2-","M_OR_AAPF",3]
[null,"Mark Havens",null,"M_SR_APF",125,null,null,null,null,null,null,null,null,null,null,185,-192.5,-192.5,null,185,null,null,null,null,null,null,null,226.56,0,1,"1-","M_OR_AAPF",3]
[null,"Joshua Albo",null,"M_JR_AAPF",110,null,null,null,null,null,null,null,null,null,null,185,190,-195,null,190,null,null,null,null,null,null,null,233.54124999999999,0,1,"1-","M_OR_AAPF",3]
[null,"Xiaver Collier",null,"M_TR_3_AAPF",90,null,null,null,null,null,null,null,null,null,null,125,140,-147.5,null,140,null,null,null,null,null,null,null,186.84299999999999,0,1,"1-","M_OR_AAPF",3]
[null,"Jered Moreland",null,"M_TR_2_AAPF",125,null,null,null,null,null,null,null,null,null,null,150,-157.5,157.5,null,157.5,null,null,null,null,null,null,null,188.28375,0,1,"1-","M_OR_AAPF",3]
[null,"Ryan Abramowicz",null,"M_TR_2_AAPF",82.5,null,null,null,null,null,null,null,null,null,null,75,80,-92.5,null,80,null,null,null,null,null,null,null,113.16374999999999,0,1,"2-","M_OR_AAPF",3]
[null,"Robert Abramowicz",null,"M_TR_2_AAPF",82.5,null,null,null,null,null,null,null,null,null,null,62.5,67.5,72.5,null,72.5,null,null,null,null,null,null,null,100.23075,0,1,"3-","M_OR_AAPF",3]
[null,"Joseph Fargo",null,"M_OEM_APF",90,null,null,null,null,null,null,null,null,null,null,-280,-280,-280,null,0,null,null,null,null,null,null,null,0,0,1,0,"M_OR_AAPF",0]
[null,"Carlos Kendal Jr",null,"M_OR_AAPF",125,null,null,null,null,null,null,null,null,null,null,185,207.5,-220,null,207.5,null,null,null,null,null,null,null,248.31625,0,1,"1-","M_OR_AAPF",3]
[null,"Steven Huges",null,"M_OR_AAPF",125,null,null,null,null,null,null,null,null,null,null,167.5,185,-190,null,185,null,null,null,null,null,null,null,221.02875,0,1,"2-","M_OR_AAPF",3]
[null,"Marlin Outley",null,"M_OR_AAPF",110,null,null,null,null,null,null,null,null,null,null,160,165,172.5,null,172.5,null,null,null,null,null,null,null,211.03125,0,1,"3-","M_OR_AAPF",3]
[null,"Kelvin Shaw",null,"M_OR_AAPF",125,null,null,null,null,null,null,null,null,null,null,157.5,162.5,172.5,null,172.5,null,null,null,null,null,null,null,204.2175,0,1,"4-","M_OR_AAPF",3]
[null,"Anthony Celini",null,"M_OR_AAPF",75,null,null,null,null,null,null,null,null,null,null,135,145,150,null,150,null,null,null,null,null,null,null,224.2175,0,1,"5-","M_OR_APF",3]
[null,"Teddie Williams",null,"M_OR_AAPF",100,null,null,null,null,null,null,null,null,null,null,140,147.5,-155,null,147.5,null,null,null,null,null,null,null,186.17599999999999,0,1,"6-","M_OR_APF",3]
[null,"Alan Mems II",null,"M_OR_AAPF",82.5,null,null,null,null,null,null,null,null,null,null,127.5,142.5,-147.5,null,142.5,null,null,null,null,null,null,null,200.4615,0,1,"7-","M_OR_APF",3]
[null,"Joseph Parus",null,"M_OR_AAPF",90,null,null,null,null,null,null,null,null,null,null,120,127.5,147.5,null,147.5,null,null,null,null,null,null,null,183.78,0,1,"8-","M_OR_AAPF",3]
[null,"Max Aidenbaum",null,"M_OR_AAPF",75,null,null,null,null,null,null,null,null,null,null,115,120,122.5,null,122.5,null,null,null,null,null,null,null,186.273,0,1,"9-","M_OR_AAPF",3]
[null,"Bryan Peregord",null,"M_OR_AAPF",110,null,null,null,null,null,null,null,null,null,null,102.5,112.5,120,null,120,null,null,null,null,null,null,null,146.315,0,1,"10-","M_OR_AAPF",3]
[null,"John Maison",null,"M_OR_AAPF",75,null,null,null,null,null,null,null,null,null,null,100,107.5,-115,null,107.5,null,null,null,null,null,null,null,162.12649999999999,0,1,"11-","M_OR_AAPF",3]
[null,"Patrick Linton",null,"M_OR_AAPF",82.5,null,null,null,null,null,null,null,null,null,null,97.5,-100,-100,null,97.5,null,null,null,null,null,null,null,142.91550000000001,0,1,"12-","M_OR_AAPF",3]
[null,"John Karns",null,"M_OR_AAPF",75,null,null,null,null,null,null,null,null,null,null,-92.5,-92.5,-92.5,null,0,null,null,null,null,null,null,null,0,0,1,0,"M_OR_AAPF",0]
[null,"John Fricke",null,"M_OR_APF",140,null,null,null,null,null,null,null,null,null,null,152.5,162.5,-192.5,null,162.5,null,null,null,null,null,null,null,188.62925000000001,0,1,"1-","M_OR_APF",3]
[null,"Jordan Barr",null,"M_OR_APF",125,null,null,null,null,null,null,null,null,null,null,137.5,147.5,-160,null,147.5,null,null,null,null,null,null,null,174.16,0,1,"2-","M_OR_APF",3]
[null,"Michael Hamilton",null,"M_OR_APF",110,null,null,null,null,null,null,null,null,null,null,-140,-140,-140,null,0,null,null,null,null,null,null,null,0,0,1,0,"M_OR_APF",0]

{"sheet":"Loading Chart","index":2,"n_rows":258,"n_cols":2,"rows_kept":258,"cut":false,"hidden":true,"merged":[]}
["Kilos","Pounds"]
[32.5,{"$f":"CONVERT(A2*1000, \"g\", \"lbm\")","v":71.650235210085214}]
[35,{"$f":"CONVERT(A3*1000, \"g\", \"lbm\")","v":77.161791764707147}]
[37.5,82.673348319329094]
[40,88.184904873951027]
[42.5,93.696461428572974]
[45,99.208017983194907]
[47.5,104.71957453781685]
[50,110.23113109243879]
[52.5,115.74268764706072]
[55,121.25424420168267]
[57.5,126.7658007563046]
[60,132.27735731092653]
[62.5,137.78891386554849]
[65,143.30047042017043]
[67.5,148.81202697479236]
[70,154.32358352941429]
[72.5,159.83514008403623]
[75,165.34669663865819]
[77.5,170.85825319328012]
[80,176.36980974790205]
[82.5,181.88136630252399]
[85,187.39292285714595]
[87.5,192.90447941176788]
[90,198.41603596638981]
[92.5,203.92759252101175]
[95,209.43914907563371]
[97.5,214.95070563025564]
[100,220.46226218487757]
[102.5,225.97381873949951]
[105,231.48537529412144]
[107.5,236.9969318487434]
[110,242.50848840336533]
[112.5,248.02004495798727]
[115,253.5316015126092]
[117.5,259.04315806723116]
[120,264.55471462185307]
[122.5,270.06627117647503]
[125,275.57782773109699]
[127.5,281.08938428571889]
[130,286.60094084034085]
[132.5,292.11249739496276]
[135,297.62405394958472]
[137.5,303.13561050420668]
[140,308.64716705882859]
[142.5,314.15872361345055]
[145,319.67028016807245]
[147.5,325.18183672269441]
[150,330.69339327731637]
[152.5,336.20494983193828]
[155,341.71650638656024]
[157.5,347.2280629411822]
[160,352.73961949580411]
[162.5,358.25117605042607]
[165,363.76273260504797]
[167.5,369.27428915966993]
[170,374.7858457142919]
[172.5,380.2974022689138]
[175,385.80895882353576]
[177.5,391.32051537815767]
[180,396.83207193277963]
[182.5,402.34362848740159]
[185,407.85518504202349]
[187.5,413.36674159664545]
[190,418.87829815126742]
[192.5,424.38985470588932]
[195,{"$f":"CONVERT(A67*1000, \"g\", \"lbm\")","v":429.90141126051128}]
[197.5,435.41296781513319]
[200,440.92452436975515]
[202.5,446.43608092437711]
[205,451.94763747899901]
[207.5,457.45919403362097]
[210,462.97075058824288]
[212.5,468.48230714286484]
[215,473.9938636974868]
[217.5,479.50542025210871]
[220,485.01697680673067]
[222.5,490.52853336135257]
[225,496.04008991597453]
[227.5,501.55164647059649]
[230,507.0632030252184]
[232.5,512.57475957984036]
[235,518.08631613446232]
[237.5,523.59787268908428]
[240,529.10942924370613]
[242.5,534.62098579832809]
[245,540.13254235295005]
[247.5,545.64409890757202]
[250,551.15565546219398]
[252.5,556.66721201681582]
[255,562.17876857143779]
[257.5,567.69032512605975]
[260,573.20188168068171]
[262.5,578.71343823530367]
[265,584.22499478992552]
[267.5,589.73655134454748]
[270,595.24810789916944]
[272.5,600.7596644537914]
[275,606.27122100841336]
[277.5,611.78277756303521]
[280,617.29433411765717]
[282.5,622.80589067227913]
[285,628.31744722690109]
[287.5,633.82900378152306]
[290,639.3405603361449]
[292.5,644.85211689076687]
[295,650.36367344538883]
[297.5,655.87523000001079]
[300,661.38678655463275]
[302.5,666.89834310925471]
[305,672.40989966387656]
[307.5,677.92145621849852]
[310,683.43301277312048]
[312.5,688.94456932774244]
[315,694.4561258823644]
[317.5,699.96768243698625]
[320,705.47923899160821]
[322.5,710.99079554623017]
[325,716.50235210085214]
[327.5,722.0139086554741]
[330,727.52546521009594]
[332.5,733.03702176471791]
[335,738.54857831933987]
[337.5,744.06013487396183]
[340,749.57169142858379]
[342.5,755.08324798320564]
[345,760.5948045378276]
[347.5,766.10636109244956]
[350,771.61791764707152]
[352.5,777.12947420169348]
[355,{"$f":"CONVERT(A131*1000, \"g\", \"lbm\")","v":782.64103075631533}]
[357.5,788.15258731093729]
[360,793.66414386555925]
[362.5,799.17570042018122]
[365,804.68725697480318]
[367.5,810.19881352942502]
[370,815.71037008404699]
[372.5,821.22192663866895]
[375,826.73348319329091]
[377.5,832.24503974791287]
[380,837.75659630253483]
[382.5,843.26815285715668]
[385,848.77970941177864]
[387.5,854.2912659664006]
[390,859.80282252102256]
[392.5,865.31437907564452]
[395,870.82593563026637]
[397.5,876.33749218488833]
[400,881.84904873951029]
[402.5,887.36060529413226]
[405,892.87216184875422]
[407.5,898.38371840337606]
[410,903.89527495799803]
[412.5,909.40683151261999]
[415,914.91838806724195]
[417.5,920.42994462186391]
[420,925.94150117648576]
[422.5,931.45305773110772]
[425,936.96461428572968]
[427.5,942.47617084035164]
[430,947.9877273949736]
[432.5,953.49928394959545]
[435,959.01084050421741]
[437.5,964.52239705883937]
[440,970.03395361346134]
[442.5,975.5455101680833]
[445,981.05706672270514]
[447.5,986.56862327732711]
[450,992.08017983194907]
[452.5,997.59173638657103]
[455,1003.103292941193]
[457.5,1008.614849495815]
[460,1014.1264060504368]
[462.5,1019.6379626050588]
[465,1025.1495191596807]
[467.5,1030.6610757143026]
[470,1036.1726322689246]
[472.5,1041.6841888235465]
[475,1047.1957453781686]
[477.5,1052.7073019327904]
[480,1058.2188584874123]
[482.5,1063.7304150420343]
[485,1069.2419715966562]
[487.5,1074.7535281512783]
[490,1080.2650847059001]
[492.5,1085.776641260522]
[495,1091.288197815144]
[497.5,1096.7997543697659]
[500,1102.311310924388]
[502.5,1107.8228674790098]
[505,1113.3344240336316]
[507.5,1118.8459805882537]
[510,1124.3575371428756]
[512.5,1129.8690936974976]
[515,{"$f":"CONVERT(A195*1000, \"g\", \"lbm\")","v":1135.3806502521195}]
[517.5,1140.8922068067413]
[520,1146.4037633613634]
[522.5,1151.9153199159853]
[525,1157.4268764706073]
[527.5,1162.9384330252292]
[530,1168.449989579851]
[532.5,1173.9615461344731]
[535,1179.473102689095]
[537.5,1184.984659243717]
[540,1190.4962157983389]
[542.5,1196.0077723529607]
[545,1201.5193289075828]
[547.5,1207.0308854622047]
[550,1212.5424420168267]
[552.5,1218.0539985714486]
[555,1223.5655551260704]
[557.5,1229.0771116806925]
[560,1234.5886682353143]
[562.5,1240.1002247899364]
[565,1245.6117813445583]
[567.5,1251.1233378991801]
[570,1256.6348944538022]
[572.5,1262.146451008424]
[575,1267.6580075630461]
[577.5,1273.169564117668]
[580,1278.6811206722898]
[582.5,1284.1926772269119]
[585,1289.7042337815337]
[587.5,1295.2157903361558]
[590,1300.7273468907777]
[592.5,1306.2389034453997]
[595,1311.7504600000216]
[597.5,1317.2620165546434]
[600,1322.7735731092655]
[602.5,1328.2851296638873]
[605,1333.7966862185094]
[607.5,1339.3082427731313]
[610,1344.8197993277531]
[612.5,1350.3313558823752]
[615,1355.842912436997]
[617.5,1361.3544689916191]
[620,1366.866025546241]
[622.5,1372.3775821008628]
[625,1377.8891386554849]
[627.5,1383.4006952101067]
[630,1388.9122517647288]
[0]
[0]
[0]
[0]
[0]
[0]
[0]
[0]
[0]
[0]
[0]
[0]
[0]
[0]
[0]
[0]
[0]

{"sheet":"Lifting","index":3,"n_rows":9,"n_cols":105,"rows_kept":9,"cut":false,"hidden":false,"merged":[[1,30,5,30],[2,3,2,5],[2,1,2,2],[3,1,3,2],[1,1,1,4],[4,5,4,6],[0,7,0,8],[1,5,1,6],[3,3,3,5],[0,1,0,4],[0,5,0,6]]}
[{"$f":"COUNTIF(INDIRECT(AG1),RIGHT(B8,1))","v":0},"Sort-on",null,null,null,"Div",null,"Wt Cls",null,{"$f":"IF(ISERROR(A2),1,0)","v":1},0,null,null,null,null,null,null,null,null,null,null,null,null,null,null,null,null,null,null,null,null,null,{"$f":"CONCATENATE(\"$b$9:$b$\",$AF$7)","v":"$b$9:$b$26"},null,{"$f":"CONCATENATE(\"Setup!O7:O\",COUNTA(Setup!O:O)+4)","v":"Setup!O7:O247"},null,null,null,null,null,null,null,null,null,null,null,null,null,null,null,null,"PL Total",{"$f":"VLOOKUP($AZ$1,$AZ$2:$BM$6,2,FALSE)","v":"$BB$1:$BM$1"},{"$f":"VLOOKUP($AZ$1,$AZ$2:$BM$6,3,FALSE)","v":" Squat  1"},{"$f":"VLOOKUP($AZ$1,$AZ$2:$BM$6,4,FALSE)","v":" Squat  2"},{"$f":"VLOOKUP($AZ$1,$AZ$2:$BM$6,5,FALSE)","v":" Squat  3"},{"$f":"VLOOKUP($AZ$1,$AZ$2:$BM$6,6,FALSE)","v":" Squat  4"},{"$f":"VLOOKUP($AZ$1,$AZ$2:$BM$6,7,FALSE)","v":"Bench 1"},{"$f":"VLOOKUP($AZ$1,$AZ$2:$BM$6,8,FALSE)","v":"Bench 2"},{"$f":"VLOOKUP($AZ$1,$AZ$2:$BM$6,9,FALSE)","v":"Bench 3"},{"$f":"VLOOKUP($AZ$1,$AZ$2:$BM$6,10,FALSE)","v":"Bench 4"},{"$f":"VLOOKUP($AZ$1,$AZ$2:$BM$6,11,FALSE)","v":"Deadlift 1"},{"$f":"VLOOKUP($AZ$1,$AZ$2:$BM$6,12,FALSE)","v":"Deadlift 2"},{"$f":"VLOOKUP($AZ$1,$AZ$2:$BM$6,13,FALSE)","v":"Deadlift 3"},{"$f":"VLOOKUP($AZ$1,$AZ$2:$BM$6,14,FALSE)","v":"Deadlift 4"},null,null,"A",{"$f":"IF(BP1=RIGHT($B$8,1),0,BQ8+1)","v":0}]
[{"$f":"CONCATENATE(CHOOSE(MATCH(B3,K8:Z8,0),\"K\",\"L\",\"M\",\"N\",\"O\",\"P\",\"Q\",\"R\",\"S\",\"T\",\"U\",\"V\",\"W\",\"X\",\"Y\",\"Z\"),MATCH(B2,INDIRECT(A7),0)+9,)","v":{"$error":"#N/A"}},"Fogg, Abby",null,null,null,{"$f":"INDIRECT(CONCATENATE(\"E\",A4))","v":{"$error":"#N/A"}},null,{"$f":"IF(INDIRECT(CONCATENATE(\"G\",A4))=\"SHW\",\"SHW\",ROUND(INDIRECT(CONCATENATE(\"G\",A4)),1))","v":{"$error":"#N/A"}},{"$f":"IF(H2=\"SHW\",\"\",IF(G8=\"WtCls (Kg)\",\"Kg\",\"Lb\"))","v":{"$error":"#N/A"}},51778.12109375,null,null,null,null,null,null,null,null,null,null,null,null,null,null,null,null,null,null,null,null,null,null,null,null,null,null,null,null,null,null,null,null,null,null,null,null,null,null,null,null,null,"Best Bench","$BB$1:$BE$1","Bench 1","Bench 2","Bench 3","Bench 4",null,null,null,null,null,null,null,null,null,null,"B",{"$f":"IF(BP2=RIGHT($B$8,1),0,BQ1+1)","v":1}]
[{"$f":"MATCH(B3,K8:Z8,0)+10","v":23},"Deadlift 1",null,{"$f":"INDIRECT(A2)","v":{"$error":"#N/A"}},null,null,{"$f":"Setup!H4","v":"Kg"},{"$f":"ABS(D3)","v":{"$error":"#N/A"}},{"$f":"-1*H3","v":{"$error":"#N/A"}},4,null,null,null,null,null,null,null,null,null,null,null,null,null,null,null,null,null,null,null,null,null,null,null,null,null,null,null,null,null,null,null,null,null,null,null,null,null,null,null,null,null,"Best Deadlift","$BB$1:$BE$1","Deadlift 1","Deadlift 2","Deadlift 3","Deadlift 4",null,null,null,null,null,null,null,null,null,null,"C",{"$f":"IF(BP3=RIGHT($B$8,1),0,BQ2+1)","v":2}]
[{"$f":"MATCH(B2,INDIRECT(A7),0)+9","v":{"$error":"#N/A"}},{"$f":"IF(LEFT(B3,1)=\"D\",\"\",CONCATENATE(\"Rack - \",IF(LEFT(B3,2)=\" S\",INDIRECT(CONCATENATE(\"J\",A4)),INDIRECT(CONCATENATE(\"P\",A4)))))","v":""},null,{"$f":"IF(G4=\"Lb\",2.2046*D3,D3/2.2046)","v":{"$error":"#N/A"}},null,null,{"$f":"IF(G3=\"Kg\",\"Lb\",\"Kg\")","v":"Lb"},"K13",null,63.83,null,null,null,null,null,null,null,null,null,null,null,null,null,null,null,null,null,null,null,null,null,null,null,null,null,null,null,null,null,null,null,null,null,null,null,null,null,null,null,null,null,"Best Squat","$BB$1:$BE$1"," Squat  1"," Squat  2"," Squat  3"," Squat  4",null,null,null,null,null,null,null,null,null,null,"D",3]
[{"$f":"CONCATENATE(IF(AND($A$3>10,$A$3<15),\"O\",IF(AND($A$3>16,$A$3<21),\"U\",\"AA\")),$A$4)","v":{"$error":"#N/A"}},null,null,null,null,"automatic",null,null,null,"00:06:55",null,null,null,null,null,null,null,null,null,null,null,null,null,null,null,null,null,null,null,null,null,null,null,null,null,null,null,null,null,null,null,null,null,null,null,null,null,null,null,null,null,"PL Total","$BB$1:$BM$1"," Squat  1"," Squat  2"," Squat  3"," Squat  4","Bench 1","Bench 2","Bench 3","Bench 4","Deadlift 1","Deadlift 2","Deadlift 3","Deadlift 4",null,null,"E",4]
[{"$f":"CONCATENATE(IF(AND($A$3>10,$A$3<15),\"O\",IF(AND($A$3>16,$A$3<21),\"U\",\"AA\")),1)","v":"AA1"},null,null,null,null,null,null,null,null,null,null,null,null,null,null,null,null,null,null,null,null,null,null,null,null,null,null,null,null,null,null,{"$f":"A1+10","v":10},null,null,null,null,null,null,null,null,null,null,null,null,null,null,null,null,null,null,null,"Push Pull Total","$BB$1:$BI$1","Bench 1","Bench 2","Bench 3","Bench 4","Deadlift 1","Deadlift 2","Deadlift 3","Deadlift 4",null,null,null,null,null,null,"F",5]
[{"$f":"CONCATENATE(\"$C$10:$C$\",A1+9)","v":"$C$10:$C$9"},null,null,null,null,null,null,null,null,null,null,null,null,null,null,null,null,null,null,null,null,null,null,null,null,null,null,null,null,null,null,26,{"$f":"CONCATENATE(\"$AG$9:$AG$\",$AF$7)","v":"$AG$9:$AG$26"},null,null,{"$f":"IF($AB$8=\"PL Total\",\"PL\",IF($AB$8=\"Push Pull Total\",\"PP\",IF($AB$8=\"Best Squat\",\"SQ\",IF($AB$8=\"Best Bench\",\"BP\",\"DL\"))))","v":"PL"},null,null,null,null,null,null,null,null,{"$f":"CONCATENATE(\"AR10:AR\",AF7)","v":"AR10:AR26"},null,{"$f":"CONCATENATE(\"AT10:AT\",AF7)","v":"AT10:AT26"},null,null,null,null,null,null,null,null,null,null,null,null,null,null,null,null,null,null,null,null,"G",6]
["Sort data","Flt A","Name","Age","Div",{"$f":"Setup!K6","v":"BWt (Kg)"},{"$f":"IF(F8=\"BWt (Kg)\",\"WtCls (Kg)\",\"WtCls (Lb)\")","v":"WtCls (Kg)"},{"$f":"Setup!K30","v":"Glossbrenner"},"Lot #","RH Sq"," Squat  1"," Squat  2"," Squat  3"," Squat  4","Best Squat","RH BP","Bench 1","Bench 2","Bench 3","Bench 4","Best Bench","Sub Total","Deadlift 1","Deadlift 2","Deadlift 3","Deadlift 4","Best Deadlift","PL Total","Coeff Score","Age  & Coeff","Pl code","Pl-Div-WtCl","Tm Pts","Team","Events","Event check","sort #","lbs/kg","PL Total","Push Pull Total","M/F",null,"valid score?","scoring value","rank","Div wt","Div rank","place","bwt","bwt rank","abs score",null,null,null,null,null,null,null,null,null,null,null,null,null,null,null,null,"H",7,null,null,null,null,null,null,null,null,null,null,null,null,null,null,null,null,null,null,"status"," Squat  1"," Squat  2"," Squat  3"," Squat  4","Best Squat","RH BP","Bench 1","Bench 2","Bench 3","Bench  4","Best Bench","Sub Total","Deadlift 1","Deadlift 2","Deadlift 3","Deadlift 4","Best Deadlift"]
[{"$f":"IF(K9,ABS(K9)+0.0001*I9,\"\")","v":""},null,null,null,null,null,{"$f":"IF(OR(E9=\"\",F9=\"\"),\"\",IF(LEFT(E9,1)=\"M\",VLOOKUP(F9,Setup!$J$9:$K$23,2,TRUE),VLOOKUP(F9,Setup!$L$9:$M$23,2,TRUE)))","v":""},{"$f":"IF(F9=\"\",0,VLOOKUP(AL9,DATA!$L$2:$N$1910,IF(LEFT(E9,1)=\"F\",3,2)))","v":0},null,null,null,null,null,null,{"$f":"IF(MAX(CK9:CM9)>0,MAX(ABS(K9)*CK9,ABS(L9)*CL9,CM9*ABS(M9)),0)","v":0},null,null,null,null,null,{"$f":"IF(MAX(CQ9:CS9)>0,MAX(ABS(Q9)*CQ9,ABS(R9)*CR9,CS9*ABS(S9)),0)","v":0},{"$f":"IF(OR(O9=0,U9=0),0,O9+U9)","v":0},null,null,null,null,{"$f":"IF(MAX(CW9:CY9)>0,MAX(ABS(W9)*CW9,ABS(X9)*CX9,CY9*ABS(Y9)),0)","v":0},{"$f":"AJ9*IF($AB$8=\"PL Total\",AM9,IF($AB$8=\"Push Pull Total\",AN9,IF($AB$8=\"Best Squat\",O9,IF($AB$8=\"Best Bench\",U9,AA9))))","v":0},{"$f":"IF(OR(F9=\"\",AB9=0),0,H9*IF(AND($G$3=\"Lb\",$H$8=\"Wilks\"),AB9/2.2046,AB9))","v":0},{"$f":"IF(OR(AB9=0,D9=\"\",D9<40),0,VLOOKUP($D9,DATA!$A$2:$B$53,2,TRUE)*AC9)","v":0},{"$f":"IF(E9=\"\",\"\",OFFSET(Setup!$Q$1,MATCH(E9,Setup!O:O,0)-1,0))","v":""},{"$f":"IF(OR(AB9=0,AR9=0),0,CONCATENATE(AV9,\"-\",E9,IF(AE9=1,\"-\",\"\"),IF(AE9=1,IF(G9=\"SHW\",G9,ROUND(G9,1)),\"\")))","v":0},{"$f":"IF(OR(AB9=0),0,VLOOKUP(AV9,Setup!$S$6:$T$15,2,TRUE))","v":0},null,null,{"$f":"IF(ISERROR(FIND($AJ$7,AI9)),0,1)","v":0},{"$f":"IF(B9=\"\",\"\",VLOOKUP(B9,$BP$1:$BQ$8,2,FALSE))","v":""},{"$f":"ROUND(IF($F$8=\"BWt (Kg)\",F9,F9/2.2046),1)","v":0},{"$f":"IF(OR(O9=0,U9=0,AA9=0),0,O9+U9+AA9)","v":0},{"$f":"IF(OR(U9=0,AA9=0),0,U9+AA9)","v":0},{"$f":"IF(E9=\"\",\"\",LEFT(E9,1))","v":""},null,{"$f":"IF(OR(ISERROR(E9),F9=\"\",ISERROR(G9),AB9=0),0,1)","v":0},{"$f":"IF(OR(ISERROR(AY9),ISERROR(AX9)),0,AY9)","v":0},{"$f":"RANK(AR9,INDIRECT($AS$7))","v":{"$error":"#N/A"}},{"$f":"INT(AR9/1000000)","v":0},{"$f":"RANK(AT9,INDIRECT($AU$7))","v":{"$error":"#N/A"}},{"$f":"AS9-AU9+1","v":{"$error":"#N/A"}},{"$f":"F9","v":0},{"$f":"RANK(AW9,AW:AW)","v":1},{"$f":"IF(OR(E9=\"\",F9=\"\",ISERROR(AE9)),0,(100000000*MATCH(E9,INDIRECT($AI$1),0)+IF(AE9=1,(16-IF(AO9=\"M\",MATCH(G9,Setup!$K$9:$K$23,0),MATCH(G9,Setup!$M$9:$M$23)))*1000000,0)+IF(AB9>0,IF(AE9=1,RANK(AB9,AB:AB,-1)*1000+AX9,IF(AE9=2,AC9,AD9)),0)))","v":0},null,null,null,null,null,null,null,null,null,null,null,null,null,null,null,null,null,null,null,null,null,null,null,null,null,null,null,null,null,null,null,null,null,null,null,null,0,0,0,0,0,0,0,0,0,0,0,0,0,0,0,0,0]

{"sheet":"BarLoad","index":4,"n_rows":16,"n_cols":12,"rows_kept":16,"cut":false,"hidden":false,"merged":[[15,0,16,7],[5,9,6,15],[15,9,16,15],[0,0,1,15],[3,0,3,1],[3,11,3,15],[5,0,6,7],[2,0,2,10],[4,11,4,15],[3,2,3,4],[3,5,3,6],[3,7,3,8]]}
[{"$f":"IF(RIGHT(Lifting!$B$2,1) = \")\",MID(Lifting!$B$2,1,(SEARCH(\"(\",Lifting!$B$2,1)-2)),Lifting!$B$2)","v":"Fogg, Abby"}]
[]
[{"$f":"INDIRECT(\"Lifting!AH\"&Lifting!A4)","v":{"$error":"#N/A"}}]
[{"$f":"Lifting!B8","v":"Flt A"},null,{"$f":"Lifting!B3","v":"Deadlift 1"},null,null,"Wt Cls:",null,{"$f":"Lifting!H2","v":{"$error":"#N/A"}},null,null,null,{"$f":"Lifting!B4","v":""}]
[null,null,null,null,null,null,null,null,null,null,null,{"$f":"CONCATENATE(\"#25 - \",Setup!H12)","v":{"$error":"#N/A"}}]
[{"$f":"Lifting!D3","v":{"$error":"#N/A"}},null,null,null,null,null,null,null,null,{"$f":" Lifting!G3","v":"Kg"}]
[]
[]
[]
[]
[]
[]
[]
[]
[]
[{"$f":"Lifting!D4","v":{"$error":"#N/A"}},null,null,null,null,null,null,null,null,{"$f":"Lifting!G4","v":"Lb"}]

{"sheet":"Upcoming Flights","index":5,"n_rows":0,"n_cols":0,"rows_kept":0,"cut":false,"hidden":false,"merged":[]}

{"sheet":"3-Lift","index":6,"n_rows":0,"n_cols":0,"rows_kept":0,"cut":false,"hidden":false,"merged":[]}

{"sheet":"Squat","index":7,"n_rows":0,"n_cols":0,"rows_kept":0,"cut":false,"hidden":false,"merged":[]}

{"sheet":"Bench","index":8,"n_rows":0,"n_cols":0,"rows_kept":0,"cut":false,"hidden":false,"merged":[]}

{"sheet":"Deadlift","index":9,"n_rows":0,"n_cols":0,"rows_kept":0,"cut":false,"hidden":false,"merged":[]}

{"sheet":"DATA","index":10,"n_rows":1910,"n_cols":22,"rows_kept":1910,"cut":false,"hidden":true,"merged":[[11,4,11,5],[1,2,10,2],[12,2,21,2]]}
["Age","Coeff",null,null,"Copyright - Joe Marksteiner - 2005",null,null,null,null,null,null,"KG","Men's Coeff","Women's Coeff","Men Schwartz","Women Malone","Men-Wilks","Women Wilks","Men G'brenner","Women G'Brenner","Men Reshel","Women Reshel"]
[14,1.23,"Foster Age Multiples",null,null,null,null,null,null,null,null,40,1.3243499999999999,1.3436999999999999,1.3132999999999999,1.1938,1.3353999999999999,1.4936,1.3243499999999999,1.3436999999999999,null,3.145]
[15,1.18,null,null,null,null,null,null,null,null,null,40.1,1.3201499999999999,1.3414999999999999,1.3091999999999999,1.1915,1.3310999999999999,1.4915,1.3201499999999999,1.3414999999999999,null,3.129]
[16,1.1299999999999999,null,null,null,null,null,null,null,null,null,40.200000000000003,1.3159999999999998,1.3392999999999999,1.3051999999999999,1.1892,1.3268,1.4894000000000001,1.3159999999999998,1.3392999999999999,null,3.113]
[17,1.08,null,null,null,null,null,null,null,null,null,40.299999999999997,1.3117999999999999,1.337,1.3010999999999999,1.1869000000000001,1.3225,1.4872000000000001,1.3117999999999999,1.337,null,3.113]
[18,1.06,null,null,null,null,null,null,null,null,null,40.4,1.30765,1.3348,1.2970999999999999,1.1846000000000001,1.3182,1.4851000000000001,1.30765,1.3348,null,3.097]
[19,1.04,null,null,null,null,null,null,null,null,null,40.5,1.30355,1.3326,1.2930999999999999,1.1822999999999999,1.3140000000000001,1.4830000000000001,1.30355,1.3326,null,3.0649999999999999]
[20,1.03,null,null,null,null,null,null,null,null,null,40.6,1.29945,1.3305,1.2890999999999999,1.181,1.3098000000000001,1.4809000000000001,1.29945,1.3305,null,3.0489999999999999]
[21,1.02,null,null,null,null,null,null,null,null,null,40.700000000000003,1.2953999999999999,1.3283,1.2850999999999999,1.1778,1.3057000000000001,1.4787999999999999,1.2953999999999999,1.3283,null,3.0329999999999999]
[22,1.01,null,null,null,null,null,null,null,null,null,40.799999999999997,1.2913999999999999,1.3261000000000001,1.2811999999999999,1.1756,1.3016000000000001,1.4765999999999999,1.2913999999999999,1.3261000000000001,null,3.0329999999999999]
[23,1,null,null,null,null,null,null,null,null,null,41,1.2834000000000001,1.3217000000000001,1.2734000000000001,1.1732,1.2934000000000001,1.4723999999999999,1.2834000000000001,1.3217000000000001,null,3.0169999999999999]
[30,1,null,null,"Weight Classes (Kg)",null,null,null,null,null,null,41.1,1.2794500000000002,1.3194999999999999,1.2695000000000001,1.1711,1.2894000000000001,1.4702,1.2794500000000002,1.3194999999999999,null,2.9849999999999999]
[40,1,"McCulloch Numbers",null,"KG","LB","Upper limit (lbs)",null,null,null,null,41.2,1.2755000000000001,1.3173999999999999,1.2656000000000001,1.1689000000000001,1.2854000000000001,1.4681,1.2755000000000001,1.3173999999999999,null,2.9710000000000001]
[41,1.01,null,null,44,97,97.002400000000009,null,null,null,null,41.3,1.2716000000000001,1.3151999999999999,1.2618,1.1667000000000001,1.2814000000000001,1.466,1.2716000000000001,1.3151999999999999,null,2.9570000000000003]
[42,1.02,null,null,48,105,105.82080000000001,null,null,null,null,41.4,1.2677499999999999,1.3129999999999999,1.258,1.1645000000000001,1.2775000000000001,1.4638,1.2677499999999999,1.3129999999999999,null,2.9570000000000003]
[43,1.0309999999999999,null,null,52,114,114.6392,null,null,null,null,41.5,1.2639,1.3109,1.2542,1.1623000000000001,1.2736000000000001,1.4617,1.2639,1.3109,null,2.9430000000000001]
[44,1.0429999999999999,null,null,56,123,123.45760000000001,null,null,null,null,41.6,1.2600500000000001,1.3087,1.2504,1.1600999999999999,1.2697000000000001,1.4595,1.2600500000000001,1.3087,null,2.915]
[45,1.0549999999999999,null,null,60,132,132.27600000000001,null,null,null,null,41.7,1.2562500000000001,1.3065,1.2466999999999999,1.1578999999999999,1.2658,1.4574,1.2562500000000001,1.3065,null,2.9018000000000002]
[46,1.0680000000000001,null,null,67.5,148,148.81050000000002,null,null,null,null,41.8,1.2524500000000001,1.3043,1.2428999999999999,1.1556999999999999,1.262,1.4552,1.2524500000000001,1.3043,null,2.8886000000000003]
[47,1.0820000000000001,null,null,75,165,165.345,null,null,null,null,41.9,1.2677499999999999,1.3022,1.2773000000000001,1.1535,1.2582,1.4531000000000001,1.2677499999999999,1.3022,null,2.8886000000000003]
[48,1.097,null,null,82.5,181,181.87950000000001,null,null,null,null,42,1.2450000000000001,1.3001,1.2355,1.1514,1.2544999999999999,1.4510000000000001,1.2450000000000001,1.3001,null,2.8754]
[49,1.113,null,null,90,198,198.41400000000002,null,null,null,null,42.1,1.24125,1.2979000000000001,1.2318,1.1492,1.2506999999999999,1.4488000000000001,1.24125,1.2979000000000001,null,2.8490000000000002]
[50,1.1299999999999999,null,null,100,220,220.46,null,null,null,null,42.2,1.2376,1.2958000000000001,1.2282,1.1471,1.2470000000000001,1.4467000000000001,1.2376,1.2958000000000001,null,2.8362000000000003]
[51,1.147,null,null,110,242,242.506,null,null,null,null,42.3,1.2339,1.2936000000000001,1.2244999999999999,1.145,1.2433000000000001,1.4444999999999999,1.2339,1.2936000000000001,null,2.8234000000000004]
[52,1.165,null,null,125,275,275.57499999999999,null,null,null,null,42.4,1.2303000000000002,1.2915000000000001,1.2209000000000001,1.1428,1.2397,1.4423999999999999,1.2303000000000002,1.2915000000000001,null,2.8234000000000004]
[53,1.1839999999999999,null,null,140,308,308.64400000000001,null,null,null,null,42.5,1.22665,1.2894000000000001,1.2173,1.1407,1.236,1.4401999999999999,1.22665,1.2894000000000001,null,2.8108]
[54,1.204,null,null,145,319,319.66700000000003,null,null,null,null,42.6,1.2231000000000001,1.2873000000000001,1.2138,1.1386000000000001,1.2323999999999999,1.4380999999999999,1.2231000000000001,1.2873000000000001,null,2.786]
[55,1.2250000000000001,null,null,"SHW","SHW","------",null,null,null,null,42.7,1.2195499999999999,1.2850999999999999,1.2101999999999999,1.1365000000000001,1.2289000000000001,1.4359,1.2195499999999999,1.2850999999999999,null,2.7751999999999999]
[56,1.246,null,null,null,null,null,null,null,null,null,42.8,1.2160000000000002,1.2829999999999999,1.2067000000000001,1.1344000000000001,1.2253000000000001,1.4338,1.2160000000000002,1.2829999999999999,null,2.7643999999999997]
[57,1.268,null,null,null,null,null,null,null,null,null,42.9,1.2305000000000001,1.2808999999999999,1.2392000000000001,1.1323000000000001,1.2218,1.4316,1.2305000000000001,1.2808999999999999,null,2.7643999999999997]
[58,1.2909999999999999,null,null,null,null,null,null,null,null,null,43,1.2090000000000001,1.2787999999999999,1.1997,1.1303000000000001,1.2182999999999999,1.4295,1.2090000000000001,1.2787999999999999,null,2.7536]
[59,1.3149999999999999,null,null,null,44,44,null,null,null,null,43.1,1.2055,1.2766999999999999,1.1961999999999999,1.1282000000000001,1.2148000000000001,1.4273,1.2055,1.2766999999999999,null,2.7320000000000002]
[60,1.34,null,null,null,48,48,null,null,null,null,43.2,1.202,1.2746,1.1927000000000001,1.1261000000000001,1.2113,1.4252,1.202,1.2746,null,2.7216]
[61,1.3660000000000001,null,null,null,52,52,null,null,null,null,43.3,1.1985999999999999,1.2725,1.1893,1.1241000000000001,1.2079,1.4231,1.1985999999999999,1.2725,null,2.7111999999999998]
[62,1.393,null,null,null,56,56,null,null,null,null,43.4,1.1951499999999999,1.2704,1.1858,1.1220000000000001,1.2044999999999999,1.4209000000000001,1.1951499999999999,1.2704,null,2.7111999999999998]
[63,1.421,null,null,null,60,60,null,null,null,null,43.5,1.1917499999999999,1.2684,1.1823999999999999,1.1200000000000001,1.2011000000000001,1.4188000000000001,1.1917499999999999,1.2684,null,2.7010000000000001]
[64,1.45,null,null,null,67.5,67.5,null,null,null,null,43.6,1.18845,1.2662,1.1791,1.1180000000000001,1.1978,1.4166000000000001,1.18845,1.2662,null,2.681]
[65,1.48,null,null,null,75,75,null,null,null,null,43.7,1.1850499999999999,1.2642,1.1757,1.1158999999999999,1.1943999999999999,1.4145000000000001,1.1850499999999999,1.2642,null,2.6710000000000003]
[66,1.5109999999999999,null,null,null,82.5,82.5,null,null,null,null,43.8,1.1817,1.2621,1.1722999999999999,1.1138999999999999,1.1911,1.4123000000000001,1.1817,1.2621,null,2.661]
[67,1.5429999999999999,null,null,null,90,90,null,null,null,null,43.9,1.1955,1.26,1.2032,1.1119000000000001,1.1878,1.4101999999999999,1.1955,1.26,null,2.661]
[68,1.5760000000000001,null,null,null,97,97.002400000000009,null,null,null,null,44,1.1751499999999999,1.258,1.1657,1.1099000000000001,1.1846000000000001,1.4080999999999999,1.1751499999999999,1.258,null,2.6415999999999999]
[69,1.61,null,null,null,100,100,null,null,null,null,44.1,1.1718500000000001,1.2559,1.1624000000000001,1.1079000000000001,1.1813,1.4058999999999999,1.1718500000000001,1.2559,null,2.6320000000000001]
[70,1.645,null,null,null,105,105.82080000000001,null,null,null,null,44.2,1.1686000000000001,1.2538,1.1591,1.1059000000000001,1.1780999999999999,1.4037999999999999,1.1686000000000001,1.2538,null,2.6232000000000002]
[71,1.681,null,null,null,110,110,null,null,null,null,44.3,1.1653500000000001,1.2518,1.1557999999999999,1.1039000000000001,1.1749000000000001,1.4016999999999999,1.1653500000000001,1.2518,null,2.6143999999999998]
[72,1.718,null,null,null,114,114.6392,null,null,null,null,44.4,1.16215,1.2497,1.1526000000000001,1.1020000000000001,1.1717,1.3995,1.16215,1.2497,null,2.6057999999999999]
[73,1.756,null,null,null,123,123.45760000000001,null,null,null,null,44.5,1.159,1.2477,1.1494,1.1000000000000001,1.1686000000000001,1.3974,1.159,1.2477,null,2.5973999999999999]
[74,1.7949999999999999,null,null,null,125,125,null,null,null,null,44.6,1.1558000000000002,1.2457,1.1462000000000001,1.0980000000000001,1.1654,1.3953,1.1558000000000002,1.2457,null,2.589]
[75,1.835,null,null,null,132,132.27600000000001,null,null,null,null,44.7,1.15265,1.2436,1.143,1.0961000000000001,1.1623000000000001,1.3932,1.15265,1.2436,null,2.5802]
[76,1.8759999999999999,null,null,null,140,140,null,null,null,null,44.8,1.1495,1.2416,1.1397999999999999,1.0941000000000001,1.1592,1.391,1.1495,1.2416,null,2.5714000000000001]
[77,1.9179999999999999,null,null,null,145,145,null,null,null,null,44.9,1.1625999999999999,1.2396,1.169,1.0922000000000001,1.1561999999999999,1.3889,1.1625999999999999,1.2396,null,2.5626000000000002]
[78,1.9610000000000001,null,null,null,148,148.81050000000002,null,null,null,null,45,1.1442999999999999,1.2373000000000001,1.1355,1.0903,1.1531,1.3868,1.1442999999999999,1.2373000000000001,null,2.5537999999999998]
[79,2.0049999999999999,null,null,null,165,165.345,null,null,null,null,45.1,1.14025,1.2355,1.1304000000000001,1.0883,1.1500999999999999,1.3847,1.14025,1.2355,null,2.5449999999999999]
[80,2.0499999999999998,null,null,null,181,181.87950000000001,null,null,null,null,45.2,1.1372,1.2335,1.1273,1.0864,1.1471,1.3825000000000001,1.1372,1.2335,null,2.5362]
[null,null,null,null,null,198,198.41400000000002,null,null,null,null,45.3,1.13415,1.2315,1.1242000000000001,1.0845,1.1440999999999999,1.3804000000000001,1.13415,1.2315,null,2.5274000000000001]
[null,null,null,null,null,220,220.46,null,null,null,null,45.4,1.1311,1.2295,1.1211,1.0826,1.1411,1.3783000000000001,1.1311,1.2295,null,2.5190000000000001]
[null,null,null,null,null,242,242.506,null,null,null,null,45.5,1.1281500000000002,1.2275,1.1181000000000001,1.0807,1.1382000000000001,1.3762000000000001,1.1281500000000002,1.2275,null,2.5110000000000001]
[null,null,null,null,null,275,275.57499999999999,null,null,null,null,45.6,1.1251,1.2255,1.115,1.0788,1.1352,1.3741000000000001,1.1251,1.2255,null,2.5030000000000001]
[null,null,null,null,null,308,308.64400000000001,null,null,null,null,45.7,1.12215,1.2235,1.1120000000000001,1.0769,1.1323000000000001,1.3720000000000001,1.12215,1.2235,null,2.4950000000000001]
[null,null,null,null,null,319,319.66700000000003,null,null,null,null,45.8,1.1192,1.2215,1.109,1.075,1.1294,1.3698999999999999,1.1192,1.2215,null,2.4870000000000001]
[null,null,null,null,null,null,null,null,null,null,null,45.9,1.13165,1.2195,1.1367,1.0731999999999999,1.1266,1.3677999999999999,1.13165,1.2195,null,2.4790000000000001]
[null,null,null,null,null,null,null,null,null,null,null,46,1.1133999999999999,1.2175,1.1031,1.0712999999999999,1.1236999999999999,1.3656999999999999,1.1133999999999999,1.2175,null,2.4710000000000001]
[null,null,null,null,null,null,null,null,null,null,null,46.1,1.1105,1.2156,1.1001000000000001,1.0693999999999999,1.1209,1.3635999999999999,1.1105,1.2156,null,2.4630000000000001]
[null,null,null,null,null,null,null,null,null,null,null,46.2,1.10765,1.2136,1.0972,1.0676000000000001,1.1181000000000001,1.3614999999999999,1.10765,1.2136,null,2.4550000000000001]
[null,null,null,null,null,null,null,null,null,null,null,46.3,1.1047500000000001,1.2116,1.0942000000000001,1.0657000000000001,1.1153,1.3593999999999999,1.1047500000000001,1.2116,null,2.4470000000000001]
[null,null,null,null,null,null,null,null,null,null,null,46.4,1.1019000000000001,1.2097,1.0912999999999999,1.0639000000000001,1.1125,1.3573,1.1019000000000001,1.2097,null,2.4392]
[null,null,null,null,null,null,null,null,null,null,null,46.5,1.0990500000000001,1.2077,1.0884,1.0621,1.1096999999999999,1.3552999999999999,1.0990500000000001,1.2077,null,2.4316]
[null,null,null,null,null,null,null,null,null,null,null,46.6,1.0962999999999998,1.2058,1.0855999999999999,1.0602,1.107,1.3532,1.0962999999999998,1.2058,null,2.4239999999999999]
[null,null,null,null,null,null,null,null,null,null,null,46.7,1.09345,1.2038,1.0827,1.0584,1.1042000000000001,1.3511,1.09345,1.2038,null,2.4163999999999999]
[null,null,null,null,null,null,null,null,null,null,null,46.8,1.0907,1.2019,1.0799000000000001,1.0566,1.1014999999999999,1.349,1.0907,1.2019,null,2.4087999999999998]
[null,null,null,null,null,null,null,null,null,null,null,46.9,1.1024,1.2,1.1060000000000001,1.0548,1.0988,1.347,1.1024,1.2,null,2.4013999999999998]
[null,null,null,null,null,null,null,null,null,null,null,47,1.0851999999999999,1.198,1.0742,1.0529999999999999,1.0962000000000001,1.3449,1.0851999999999999,1.198,null,2.3942000000000001]
[null,null,null,null,null,null,null,null,null,null,null,47.1,1.0824499999999999,1.1960999999999999,1.0713999999999999,1.0511999999999999,1.0934999999999999,1.3428,1.0824499999999999,1.1960999999999999,null,2.387]
[null,null,null,null,null,null,null,null,null,null,null,47.2,1.07975,1.1941999999999999,1.0686,1.0494000000000001,1.0909,1.3408,1.07975,1.1941999999999999,null,2.3797999999999999]
[null,null,null,null,null,null,null,null,null,null,null,47.3,1.0770500000000001,1.1921999999999999,1.0659000000000001,1.0476000000000001,1.0882000000000001,1.3387,1.0770500000000001,1.1921999999999999,null,2.3726000000000003]
[null,null,null,null,null,null,null,null,null,null,null,47.4,1.0743499999999999,1.1903999999999999,1.0630999999999999,1.0458000000000001,1.0855999999999999,1.3367,1.0743499999999999,1.1903999999999999,null,2.3654000000000002]
[null,null,null,null,null,null,null,null,null,null,null,47.5,1.0716999999999999,1.1883999999999999,1.0604,1.0441,1.083,1.3346,1.0716999999999999,1.1883999999999999,null,2.3582000000000001]
[null,null,null,null,null,null,null,null,null,null,null,47.6,1.0691000000000002,1.1865000000000001,1.0577000000000001,1.0423,1.0805,1.3326,1.0691000000000002,1.1865000000000001,null,2.351]
[null,null,null,null,null,null,null,null,null,null,null,47.7,1.0664500000000001,1.1846000000000001,1.0549999999999999,1.0405,1.0779000000000001,1.3305,1.0664500000000001,1.1846000000000001,null,2.343]
[null,null,null,null,null,null,null,null,null,null,null,47.8,1.06385,1.1827000000000001,1.0523,1.0387999999999999,1.0753999999999999,1.3285,1.06385,1.1827000000000001,null,2.335]
[null,null,null,null,null,null,null,null,null,null,null,47.9,1.0749,1.1809000000000001,1.077,1.0369999999999999,1.0728,1.3265,1.0749,1.1809000000000001,null,2.3277999999999999]
[null,null,null,null,null,null,null,null,null,null,null,48,1.0586,1.179,1.0468999999999999,1.0353000000000001,1.0703,1.3244,1.0586,1.179,null,2.3214000000000001]
[null,null,null,null,null,null,null,null,null,null,null,48.1,1.0560499999999999,1.1771,1.0443,1.0336000000000001,1.0678000000000001,1.3224,1.0560499999999999,1.1771,null,2.3149999999999999]
[null,null,null,null,null,null,null,null,null,null,null,48.2,1.05345,1.1752,1.0416000000000001,1.0318000000000001,1.0652999999999999,1.3204,1.05345,1.1752,null,2.3077999999999999]
[null,null,null,null,null,null,null,null,null,null,null,48.3,1.0509499999999998,1.1733,1.0389999999999999,1.0301,1.0629,1.3183,1.0509499999999998,1.1733,null,2.3006000000000002]
[null,null,null,null,null,null,null,null,null,null,null,48.4,1.0484,1.1715,1.0364,1.0284,1.0604,1.3163,1.0484,1.1715,null,2.2936000000000001]
[null,null,null,null,null,null,null,null,null,null,null,48.5,1.0459000000000001,1.1696,1.0338000000000001,1.0266999999999999,1.0580000000000001,1.3143,1.0459000000000001,1.1696,null,2.2867999999999999]
[null,null,null,null,null,null,null,null,null,null,null,48.6,1.0434000000000001,1.1677999999999999,1.0311999999999999,1.0249999999999999,1.0556000000000001,1.3123,1.0434000000000001,1.1677999999999999,null,2.2799999999999998]
[null,null,null,null,null,null,null,null,null,null,null,48.7,1.04095,1.1658999999999999,1.0286999999999999,1.0233000000000001,1.0531999999999999,1.3103,1.04095,1.1658999999999999,null,2.2731999999999997]
[null,null,null,null,null,null,null,null,null,null,null,48.8,1.0384500000000001,1.1640999999999999,1.0261,1.0216000000000001,1.0508,1.3083,1.0384500000000001,1.1640999999999999,null,2.2664]
[null,null,null,null,null,null,null,null,null,null,null,48.9,1.0489999999999999,1.1621999999999999,1.0496000000000001,1.0199,1.0484,1.3063,1.0489999999999999,1.1621999999999999,null,2.2597999999999998]
[null,null,null,null,null,null,null,null,null,null,null,49,1.03355,1.1604000000000001,1.0210999999999999,1.0182,1.046,1.3043,1.03355,1.1604000000000001,null,2.2534000000000001]
[null,null,null,null,null,null,null,null,null,null,null,49.1,1.03115,1.1585000000000001,1.0185999999999999,1.0165,1.0437000000000001,1.3023,1.03115,1.1585000000000001,null,2.2469999999999999]
[null,null,null,null,null,null,null,null,null,null,null,49.2,1.0286999999999999,1.1568000000000001,1.0161,1.0147999999999999,1.0412999999999999,1.3004,1.0286999999999999,1.1568000000000001,null,2.2405999999999997]
[null,null,null,null,null,null,null,null,null,null,null,49.3,1.0712999999999999,1.1549,1.1035999999999999,1.0132000000000001,1.0389999999999999,1.2984,1.0712999999999999,1.1549,null,2.2342]
[null,null,null,null,null,null,null,null,null,null,null,49.4,1.0239,1.1531,1.0111000000000001,1.0115000000000001,1.0367,1.2964,1.0239,1.1531,null,2.2279999999999998]
[null,null,null,null,null,null,null,null,null,null,null,49.5,1.02155,1.1513,1.0086999999999999,1.0098,1.0344,1.2944,1.02155,1.1513,null,2.222]
[null,null,null,null,null,null,null,null,null,null,null,49.6,1.01915,1.1495,1.0062,1.0082,1.0321,1.2925,1.01915,1.1495,null,2.2160000000000002]
[null,null,null,null,null,null,null,null,null,null,null,49.7,1.01685,1.1476999999999999,1.0038,1.0065,1.0299,1.2905,1.01685,1.1476999999999999,null,2.2103999999999999]
[null,null,null,null,null,null,null,null,null,null,null,49.8,1.0145,1.1458999999999999,1.0014000000000001,1.0048999999999999,1.0276000000000001,1.2885,1.0145,1.1458999999999999,null,2.2048000000000001]
[null,null,null,null,null,null,null,null,null,null,null,49.9,1.0245000000000002,1.1440999999999999,1.0236000000000001,1.0033000000000001,1.0254000000000001,1.2866,1.0245000000000002,1.1440999999999999,null,2.1991999999999998]
[null,null,null,null,null,null,null,null,null,null,null,50,1.0099,1.1423000000000001,0.99660000000000004,1.0016,1.0232000000000001,1.2846,1.0099,1.1423000000000001,1.9550000000000001,2.1936]
[null,null,null,null,null,null,null,null,null,null,null,50.1,1.0076000000000001,1.1405000000000001,0.99419999999999997,1,1.0209999999999999,1.2827,1.0076000000000001,1.1405000000000001,1.9478,2.1880000000000002]
[null,null,null,null,null,null,null,null,null,null,null,50.2,1.00535,1.1388,0.9919,0.99839999999999995,1.0187999999999999,1.2807999999999999,1.00535,1.1388,1.9406000000000001,2.1823999999999999]
[null,null,null,null,null,null,null,null,null,null,null,50.3,1.00305,1.137,0.98950000000000005,0.99680000000000002,1.0165999999999999,1.2787999999999999,1.00305,1.137,1.9406000000000001,2.1768000000000001]
[null,null,null,null,null,null,null,null,null,null,null,50.4,1.0007999999999999,1.1352,0.98719999999999997,0.99519999999999997,1.0144,1.2768999999999999,1.0007999999999999,1.1352,1.9336,2.1711999999999998]
[null,null,null,null,null,null,null,null,null,null,null,50.5,0.99855000000000005,1.1334,0.9849,0.99350000000000005,1.0122,1.2749999999999999,0.99855000000000005,1.1334,1.92,2.1656]
[null,null,null,null,null,null,null,null,null,null,null,50.6,0.99635000000000007,1.1316999999999999,0.98260000000000003,0.9919,1.0101,1.2729999999999999,0.99635000000000007,1.1316999999999999,1.9127999999999998,2.16]
[null,null,null,null,null,null,null,null,null,null,null,50.7,0.99409999999999998,1.1298999999999999,0.98029999999999995,0.99039999999999995,1.0079,1.2710999999999999,0.99409999999999998,1.1298999999999999,1.9056,2.1543999999999999]
[null,null,null,null,null,null,null,null,null,null,null,50.8,0.9919,1.1282000000000001,0.97799999999999998,0.98880000000000001,1.0058,1.2692000000000001,0.9919,1.1282000000000001,1.9056,2.1488]
[null,null,null,null,null,null,null,null,null,null,null,50.9,1.00135,1.1264000000000001,0.999,0.98719999999999997,1.0037,1.2673000000000001,1.00135,1.1264000000000001,1.8985999999999998,2.1431999999999998]
[null,null,null,null,null,null,null,null,null,null,null,51,0.98750000000000004,1.1247,0.97340000000000004,0.98560000000000003,1.0016,1.2654000000000001,0.98750000000000004,1.1247,1.885,2.1375999999999999]
[null,null,null,null,null,null,null,null,null,null,null,51.1,0.98534999999999995,1.123,0.97119999999999995,0.98399999999999999,0.99950000000000006,1.2635000000000001,0.98534999999999995,1.123,1.8777999999999999,2.1320000000000001]
[null,null,null,null,null,null,null,null,null,null,null,51.2,0.98324999999999996,1.1212,0.96899999999999997,0.98250000000000004,0.99750000000000005,1.2616000000000001,0.98324999999999996,1.1212,1.8706,2.1268000000000002]
[null,null,null,null,null,null,null,null,null,null,null,51.3,0.98104999999999998,1.1194999999999999,0.9667,0.98089999999999999,0.99539999999999995,1.2597,0.98104999999999998,1.1194999999999999,1.8706,2.1216000000000004]
[null,null,null,null,null,null,null,null,null,null,null,51.4,0.97889999999999999,1.1177999999999999,0.96450000000000002,0.97929999999999995,0.99329999999999996,1.2578,0.97889999999999999,1.1177999999999999,1.8637999999999999,2.1162000000000001]
[null,null,null,null,null,null,null,null,null,null,null,51.5,0.9768,1.1161000000000001,0.96230000000000004,0.9778,0.99129999999999996,1.256,0.9768,1.1161000000000001,1.851,2.1106000000000003]
[null,null,null,null,null,null,null,null,null,null,null,51.6,0.9746999999999999,1.1144000000000001,0.96009999999999995,0.97619999999999996,0.98929999999999996,1.2541,0.9746999999999999,1.1144000000000001,1.8446,2.105]
[null,null,null,null,null,null,null,null,null,null,null,51.7,0.97265000000000001,1.1126,0.95799999999999996,0.97470000000000001,0.98729999999999996,1.2522,0.97265000000000001,1.1126,1.8382000000000001,2.0998000000000001]
[null,null,null,null,null,null,null,null,null,null,null,51.8,0.97055000000000002,1.111,0.95579999999999998,0.97309999999999997,0.98529999999999995,1.2504,0.97055000000000002,1.111,1.8382000000000001,2.0946000000000002]
[null,null,null,null,null,null,null,null,null,null,null,51.9,0.97950000000000004,1.1093,0.97570000000000001,0.97160000000000002,0.98329999999999995,1.2484999999999999,0.97950000000000004,1.1093,1.8315999999999999,2.0893999999999999]
[null,null,null,null,null,null,null,null,null,null,null,52,0.96639999999999993,1.1075999999999999,0.95150000000000001,0.97009999999999996,0.98129999999999995,1.2465999999999999,0.96639999999999993,1.1075999999999999,1.8180000000000001,2.0842000000000001]
[null,null,null,null,null,null,null,null,null,null,null,52.1,0.96435000000000004,1.1059000000000001,0.94940000000000002,0.96860000000000002,0.97929999999999995,1.2447999999999999,0.96435000000000004,1.1059000000000001,1.8120000000000001,2.0790000000000002]
[null,null,null,null,null,null,null,null,null,null,null,52.2,0.96229999999999993,1.1042000000000001,0.94730000000000003,0.96699999999999997,0.97729999999999995,1.2428999999999999,0.96229999999999993,1.1042000000000001,1.806,2.0737999999999999]
[null,null,null,null,null,null,null,null,null,null,null,52.3,0.96030000000000004,1.1025,0.94520000000000004,0.96550000000000002,0.97540000000000004,1.2411000000000001,0.96030000000000004,1.1025,1.806,2.0686]
[null,null,null,null,null,null,null,null,null,null,null,52.4,0.95835000000000004,1.1009,0.94320000000000004,0.96399999999999997,0.97350000000000003,1.2393000000000001,0.95835000000000004,1.1009,1.8,2.0633999999999997]
[null,null,null,null,null,null,null,null,null,null,null,52.5,0.95625000000000004,1.0992,0.94099999999999995,0.96250000000000002,0.97150000000000003,1.2374000000000001,0.95625000000000004,1.0992,1.788,2.0581999999999998]
[null,null,null,null,null,null,null,null,null,null,null,52.6,0.95425000000000004,1.0974999999999999,0.93889999999999996,0.96099999999999997,0.96960000000000002,1.2356,0.95425000000000004,1.0974999999999999,1.782,2.0529999999999999]
[null,null,null,null,null,null,null,null,null,null,null,52.7,0.95225000000000004,1.0959000000000001,0.93679999999999997,0.95950000000000002,0.9677,1.2338,0.95225000000000004,1.0959000000000001,1.776,2.0482]
[null,null,null,null,null,null,null,null,null,null,null,52.8,0.95029999999999992,1.0942000000000001,0.93479999999999996,0.95799999999999996,0.96579999999999999,1.232,0.95029999999999992,1.0942000000000001,1.776,2.0434000000000001]
[null,null,null,null,null,null,null,null,null,null,null,52.9,0.95874999999999999,1.0926,0.9536,0.95650000000000002,0.96389999999999998,1.2302,0.95874999999999999,1.0926,1.77,2.0383999999999998]
[null,null,null,null,null,null,null,null,null,null,null,53,0.94639999999999991,1.091,0.93069999999999997,0.95499999999999996,0.96209999999999996,1.2283999999999999,0.94639999999999991,1.091,1.758,2.0331999999999999]
[null,null,null,null,null,null,null,null,null,null,null,53.1,0.94445000000000001,1.0892999999999999,0.92869999999999997,0.9536,0.96020000000000005,1.2265999999999999,0.94445000000000001,1.0892999999999999,1.752,2.028]
[null,null,null,null,null,null,null,null,null,null,null,53.2,0.9425,1.0876999999999999,0.92669999999999997,0.95209999999999995,0.95830000000000004,1.2248000000000001,0.9425,1.0876999999999999,1.746,2.0232000000000001]
[null,null,null,null,null,null,null,null,null,null,null,53.3,0.94059999999999999,1.0861000000000001,0.92469999999999997,0.9506,0.95650000000000002,1.2230000000000001,0.94059999999999999,1.0861000000000001,1.746,2.0184000000000002]
[null,null,null,null,null,null,null,null,null,null,null,53.4,0.93869999999999998,1.0844,0.92269999999999996,0.94920000000000004,0.95469999999999999,1.2212000000000001,0.93869999999999998,1.0844,1.7398,2.0135999999999998]
[null,null,null,null,null,null,null,null,null,null,null,53.5,0.93730000000000002,1.0828,0.92179999999999995,0.94769999999999999,0.95279999999999998,1.2194,0.93730000000000002,1.0828,1.7270000000000001,2.0087999999999999]
[null,null,null,null,null,null,null,null,null,null,null,53.6,0.93489999999999995,1.0811999999999999,0.91879999999999995,0.94620000000000004,0.95099999999999996,1.2176,0.93489999999999995,1.0811999999999999,1.7210000000000001,2.004]
[null,null,null,null,null,null,null,null,null,null,null,53.7,0.93305000000000005,1.0795999999999999,0.91690000000000005,0.94479999999999997,0.94920000000000004,1.2159,0.93305000000000005,1.0795999999999999,1.7150000000000001,2]
[null,null,null,null,null,null,null,null,null,null,null,53.8,0.93115000000000003,1.0780000000000001,0.91490000000000005,0.94330000000000003,0.94740000000000002,1.2141,0.93115000000000003,1.0780000000000001,1.7150000000000001,1.996]
[null,null,null,null,null,null,null,null,null,null,null,53.9,0.93924999999999992,1.0764,0.93279999999999996,0.94189999999999996,0.94569999999999999,1.2122999999999999,0.93924999999999992,1.0764,1.7023999999999999,1.992]
[null,null,null,null,null,null,null,null,null,null,null,54,0.92749999999999999,1.0748,0.91110000000000002,0.9405,0.94389999999999996,1.2105999999999999,0.92749999999999999,1.0748,1.696,1.988]
[null,null,null,null,null,null,null,null,null,null,null,54.1,0.92565000000000008,1.0731999999999999,0.90920000000000001,0.93899999999999995,0.94210000000000005,1.2088000000000001,0.92565000000000008,1.0731999999999999,1.6903999999999999,1.984]
[null,null,null,null,null,null,null,null,null,null,null,54.2,0.92385000000000006,1.0716000000000001,0.9073,0.93759999999999999,0.94040000000000001,1.2071000000000001,0.92385000000000006,1.0716000000000001,1.6847999999999999,1.98]
[null,null,null,null,null,null,null,null,null,null,null,54.3,0.92199999999999993,1.0701000000000001,0.90539999999999998,0.93620000000000003,0.93859999999999999,1.2054,0.92199999999999993,1.0701000000000001,1.679,1.976]
[null,null,null,null,null,null,null,null,null,null,null,54.4,0.92019999999999991,1.0684,0.90349999999999997,0.93479999999999996,0.93689999999999996,1.2036,0.92019999999999991,1.0684,1.673,1.9718]
[null,null,null,null,null,null,null,null,null,null,null,54.5,0.91839999999999999,1.0669,0.90159999999999996,0.93330000000000002,0.93520000000000003,1.2019,0.91839999999999999,1.0669,1.667,1.9674]
[null,null,null,null,null,null,null,null,null,null,null,54.6,0.91660000000000008,1.0652999999999999,0.89980000000000004,0.93189999999999995,0.93340000000000001,1.2001999999999999,0.91660000000000008,1.0652999999999999,1.6622000000000001,1.9630000000000001]
[null,null,null,null,null,null,null,null,null,null,null,54.7,0.91480000000000006,1.0638000000000001,0.89790000000000003,0.93049999999999999,0.93169999999999997,1.1984999999999999,0.91480000000000006,1.0638000000000001,1.6574,1.9590000000000001]
[null,null,null,null,null,null,null,null,null,null,null,54.8,0.91305000000000003,1.0622,0.89610000000000001,0.92910000000000004,0.93,1.1967000000000001,0.91305000000000003,1.0622,1.6524000000000001,1.9550000000000001]
[null,null,null,null,null,null,null,null,null,null,null,54.9,0.92064999999999997,1.0606,0.91300000000000003,0.92769999999999997,0.92830000000000001,1.1950000000000001,0.92064999999999997,1.0606,1.6472,1.9508000000000001]
[null,null,null,null,null,null,null,null,null,null,null,55,0.90954999999999997,1.0590999999999999,0.89239999999999997,0.92630000000000001,0.92669999999999997,1.1933,0.90954999999999997,1.0590999999999999,1.6419999999999999,1.9463999999999999]
[null,null,null,null,null,null,null,null,null,null,null,55.1,0.90779999999999994,1.0575000000000001,0.89059999999999995,0.92490000000000006,0.92500000000000004,1.1916,0.90779999999999994,1.0575000000000001,1.6372,1.9419999999999999]
[null,null,null,null,null,null,null,null,null,null,null,55.2,0.90605000000000002,1.0561,0.88880000000000003,0.92349999999999999,0.92330000000000001,1.19,0.90605000000000002,1.0561,1.6323999999999999,1.9379999999999999]
[null,null,null,null,null,null,null,null,null,null,null,55.3,0.90434999999999999,1.0545,0.88700000000000001,0.92220000000000002,0.92169999999999996,1.1882999999999999,0.90434999999999999,1.0545,1.6274,1.9339999999999999]
[null,null,null,null,null,null,null,null,null,null,null,55.4,0.90264999999999995,1.0529999999999999,0.88529999999999998,0.92079999999999995,0.92,1.1866000000000001,0.90264999999999995,1.0529999999999999,1.6221999999999999,1.9301999999999999]
[null,null,null,null,null,null,null,null,null,null,null,55.5,0.90094999999999992,1.0513999999999999,0.88349999999999995,0.9194,0.91839999999999999,1.1849000000000001,0.90094999999999992,1.0513999999999999,1.617,1.9266000000000001]
[null,null,null,null,null,null,null,null,null,null,null,55.6,0.89924999999999999,1.05,0.88170000000000004,0.91800000000000004,0.91679999999999995,1.1832,0.89924999999999999,1.05,1.6122000000000001,1.923]
[null,null,null,null,null,null,null,null,null,null,null,55.7,0.89759999999999995,1.0484,0.88,0.91669999999999996,0.91520000000000001,1.1816,0.89759999999999995,1.0484,1.6073999999999999,1.9194]
[null,null,null,null,null,null,null,null,null,null,null,55.8,0.89585000000000004,1.0468999999999999,0.87819999999999998,0.9153,0.91349999999999998,1.1798999999999999,0.89585000000000004,1.0468999999999999,1.6026,1.9157999999999999]
[null,null,null,null,null,null,null,null,null,null,null,55.9,0.90310000000000001,1.0454000000000001,0.89429999999999998,0.91400000000000003,0.91190000000000004,1.1782999999999999,0.90310000000000001,1.0454000000000001,1.5977999999999999,1.9121999999999999]
[null,null,null,null,null,null,null,null,null,null,null,56,0.89254999999999995,1.0439000000000001,0.87480000000000002,0.91259999999999997,0.9103,1.1766000000000001,0.89254999999999995,1.0439000000000001,1.593,1.9086000000000001]
[null,null,null,null,null,null,null,null,null,null,null,56.1,0.89095000000000002,1.0424,0.87309999999999999,0.91120000000000001,0.90880000000000005,1.175,0.89095000000000002,1.0424,1.5878000000000001,1.905]
[null,null,null,null,null,null,null,null,null,null,null,56.2,0.88929999999999998,1.0409999999999999,0.87139999999999995,0.90990000000000004,0.90720000000000001,1.1733,0.88929999999999998,1.0409999999999999,1.5826,1.9014]
[null,null,null,null,null,null,null,null,null,null,null,56.3,0.88765000000000005,1.0394000000000001,0.86970000000000003,0.90859999999999996,0.90559999999999996,1.1717,0.88765000000000005,1.0394000000000001,1.5776000000000001,1.8977999999999999]
[null,null,null,null,null,null,null,null,null,null,null,56.4,0.88605,1.038,0.86799999999999999,0.90720000000000001,0.90410000000000001,1.1700999999999999,0.88605,1.038,1.5728,1.8941999999999999]
[null,null,null,null,null,null,null,null,null,null,null,56.5,0.88439999999999996,1.0365,0.86629999999999996,0.90590000000000004,0.90249999999999997,1.1684000000000001,0.88439999999999996,1.0365,1.5680000000000001,1.8906000000000001]
[null,null,null,null,null,null,null,null,null,null,null,56.6,0.88280000000000003,1.0349999999999999,0.86460000000000004,0.90459999999999996,0.90100000000000002,1.1668000000000001,0.88280000000000003,1.0349999999999999,1.5628,1.887]
[null,null,null,null,null,null,null,null,null,null,null,56.7,0.88119999999999998,1.0335000000000001,0.86299999999999999,0.9032,0.89939999999999998,1.1652,0.88119999999999998,1.0335000000000001,1.5575999999999999,1.8834]
[null,null,null,null,null,null,null,null,null,null,null,56.8,0.87959999999999994,1.0321,0.86129999999999995,0.90190000000000003,0.89790000000000003,1.1636,0.87959999999999994,1.0321,1.5526,1.8797999999999999]
[null,null,null,null,null,null,null,null,null,null,null,56.9,0.88644999999999996,1.0306,0.87649999999999995,0.90059999999999996,0.89639999999999997,1.1619999999999999,0.88644999999999996,1.0306,1.5477999999999998,1.8761999999999999]
[null,null,null,null,null,null,null,null,null,null,null,57,0.87644999999999995,1.0291999999999999,0.85799999999999998,0.89929999999999999,0.89490000000000003,1.1604000000000001,0.87644999999999995,1.0291999999999999,1.5429999999999999,1.8726]
[null,null,null,null,null,null,null,null,null,null,null,57.1,0.87490000000000001,1.0277000000000001,0.85640000000000005,0.89800000000000002,0.89339999999999997,1.1588000000000001,0.87490000000000001,1.0277000000000001,1.5382,1.869]
[null,null,null,null,null,null,null,null,null,null,null,57.2,0.87335000000000007,1.0263,0.8548,0.89670000000000005,0.89190000000000003,1.1572,0.87335000000000007,1.0263,1.5333999999999999,1.8653999999999999]
[null,null,null,null,null,null,null,null,null,null,null,57.3,0.87179999999999991,1.0247999999999999,0.85319999999999996,0.89539999999999997,0.89039999999999997,1.1556,0.87179999999999991,1.0247999999999999,1.5284,1.8618000000000001]
[null,null,null,null,null,null,null,null,null,null,null,57.4,0.87024999999999997,1.0234000000000001,0.85160000000000002,0.89410000000000001,0.88890000000000002,1.1540999999999999,0.87024999999999997,1.0234000000000001,1.5231999999999999,1.8584000000000001]
[null,null,null,null,null,null,null,null,null,null,null,57.5,0.86870000000000003,1.022,0.85,0.89280000000000004,0.88739999999999997,1.1525000000000001,0.86870000000000003,1.022,1.518,1.8552000000000002]
[null,null,null,null,null,null,null,null,null,null,null,57.6,0.86715000000000009,1.0205,0.84840000000000004,0.89149999999999996,0.88590000000000002,1.1509,0.86715000000000009,1.0205,1.5132000000000001,1.8520000000000001]
[null,null,null,null,null,null,null,null,null,null,null,57.7,0.86565000000000003,1.0190999999999999,0.8468,0.89019999999999999,0.88449999999999995,1.1494,0.86565000000000003,1.0190999999999999,1.5084,1.8492]
[null,null,null,null,null,null,null,null,null,null,null,57.8,0.86414999999999997,1.0177,0.84530000000000005,0.88890000000000002,0.88300000000000001,1.1477999999999999,0.86414999999999997,1.0177,1.5042,1.8464]
[null,null,null,null,null,null,null,null,null,null,null,57.9,0.87065000000000003,1.0163,0.85970000000000002,0.88759999999999994,0.88160000000000005,1.1463000000000001,0.87065000000000003,1.0163,1.5006000000000002,1.8435999999999999]
[null,null,null,null,null,null,null,null,null,null,null,58,0.86119999999999997,1.0148999999999999,0.84219999999999995,0.88629999999999998,0.88019999999999998,1.1447000000000001,0.86119999999999997,1.0148999999999999,1.4970000000000001,1.8408]
[null,null,null,null,null,null,null,null,null,null,null,58.1,0.85965000000000003,1.0135000000000001,0.84060000000000001,0.8851,0.87870000000000004,1.1432,0.85965000000000003,1.0135000000000001,1.4934000000000001,1.8380000000000001]
[null,null,null,null,null,null,null,null,null,null,null,58.2,0.85819999999999996,1.012,0.83909999999999996,0.88380000000000003,0.87729999999999997,1.1415999999999999,0.85819999999999996,1.012,1.4898,1.8348]
[null,null,null,null,null,null,null,null,null,null,null,58.3,0.85675000000000001,1.0106999999999999,0.83760000000000001,0.88249999999999995,0.87590000000000001,1.1400999999999999,0.85675000000000001,1.0106999999999999,1.486,1.8316000000000001]
[null,null,null,null,null,null,null,null,null,null,null,58.4,0.85529999999999995,1.0093000000000001,0.83609999999999995,0.88129999999999997,0.87450000000000006,1.1386000000000001,0.85529999999999995,1.0093000000000001,1.482,1.8284]
[null,null,null,null,null,null,null,null,null,null,null,58.5,0.8538,1.0079,0.83450000000000002,0.88,0.87309999999999999,1.1371,0.8538,1.0079,1.478,1.8252000000000002]
[null,null,null,null,null,null,null,null,null,null,null,58.6,0.85234999999999994,1.0065,0.83299999999999996,0.87880000000000003,0.87170000000000003,1.1355,0.85234999999999994,1.0065,1.4743999999999999,1.8220000000000001]
[null,null,null,null,null,null,null,null,null,null,null,58.7,0.85094999999999998,1.0051000000000001,0.83160000000000001,0.87749999999999995,0.87029999999999996,1.1339999999999999,0.85094999999999998,1.0051000000000001,1.4708000000000001,1.8191999999999999]
[null,null,null,null,null,null,null,null,null,null,null,58.8,0.84949999999999992,1.0037,0.83009999999999995,0.87629999999999997,0.86890000000000001,1.1325000000000001,0.84949999999999992,1.0037,1.4672000000000001,1.8164]
[null,null,null,null,null,null,null,null,null,null,null,58.9,0.85560000000000003,1.0024,0.84370000000000001,0.875,0.86750000000000005,1.131,0.85560000000000003,1.0024,1.4636,1.8135999999999999]
[null,null,null,null,null,null,null,null,null,null,null,59,0.8466499999999999,1.0009999999999999,0.82709999999999995,0.87380000000000002,0.86619999999999997,1.1294999999999999,0.8466499999999999,1.0009999999999999,1.46,1.8108]
[null,null,null,null,null,null,null,null,null,null,null,59.1,0.84525000000000006,0.99970000000000003,0.82569999999999999,0.87250000000000005,0.86480000000000001,1.1281000000000001,0.84525000000000006,0.99970000000000003,1.4563999999999999,1.8080000000000001]
[null,null,null,null,null,null,null,null,null,null,null,59.2,0.84384999999999999,0.99834999999999996,0.82420000000000004,0.87129999999999996,0.86350000000000005,1.1266,0.84384999999999999,0.99834999999999996,1.4528000000000001,1.8056000000000001]
[null,null,null,null,null,null,null,null,null,null,null,59.3,0.84244999999999992,0.99695,0.82279999999999998,0.87009999999999998,0.86209999999999998,1.1251,0.84244999999999992,0.99695,1.4492,1.8032000000000001]
[null,null,null,null,null,null,null,null,null,null,null,59.4,0.84105000000000008,0.99560000000000004,0.82130000000000003,0.86880000000000002,0.86080000000000001,1.1235999999999999,0.84105000000000008,0.99560000000000004,1.4456,1.8006]
[null,null,null,null,null,null,null,null,null,null,null,59.5,0.83965000000000001,0.99424999999999997,0.81989999999999996,0.86760000000000004,0.85940000000000005,1.1221000000000001,0.83965000000000001,0.99424999999999997,1.4419999999999999,1.7978000000000001]
[null,null,null,null,null,null,null,null,null,null,null,59.6,0.83830000000000005,0.99295,0.81850000000000001,0.86639999999999995,0.85809999999999997,1.1207,0.83830000000000005,0.99295,1.4379999999999999,1.7949999999999999]
[null,null,null,null,null,null,null,null,null,null,null,59.7,0.83689999999999998,0.99160000000000004,0.81699999999999995,0.86529999999999996,0.85680000000000001,1.1192,0.83689999999999998,0.99160000000000004,1.4339999999999999,1.7926]
[null,null,null,null,null,null,null,null,null,null,null,59.8,0.83555000000000001,0.99029999999999996,0.81559999999999999,0.86399999999999999,0.85550000000000004,1.1177999999999999,0.83555000000000001,0.99029999999999996,1.4301999999999999,1.7902]
[null,null,null,null,null,null,null,null,null,null,null,59.9,0.84139999999999993,0.9889,0.8286,0.86280000000000001,0.85419999999999996,1.1163000000000001,0.84139999999999993,0.9889,1.4266000000000001,1.7877999999999998]
[null,null,null,null,null,null,null,null,null,null,null,60,0.83284999999999998,0.98760000000000003,0.81279999999999997,0.86150000000000004,0.85289999999999999,1.1149,0.83284999999999998,0.98760000000000003,1.423,1.7853999999999999]
[null,null,null,null,null,null,null,null,null,null,null,60.1,0.83150000000000002,0.98624999999999996,0.81140000000000001,0.86029999999999995,0.85160000000000002,1.1133999999999999,0.83150000000000002,0.98624999999999996,1.4194,1.7829999999999999]
[null,null,null,null,null,null,null,null,null,null,null,60.2,0.83020000000000005,0.98494999999999999,0.81010000000000004,0.85909999999999997,0.85029999999999994,1.1120000000000001,0.83020000000000005,0.98494999999999999,1.4157999999999999,1.7802]
[null,null,null,null,null,null,null,null,null,null,null,60.3,0.82884999999999998,0.98370000000000002,0.80869999999999997,0.8579,0.84899999999999998,1.1106,0.82884999999999998,0.98370000000000002,1.4121999999999999,1.7774000000000001]
[null,null,null,null,null,null,null,null,null,null,null,60.4,0.82750000000000001,0.98240000000000005,0.80730000000000002,0.85680000000000001,0.84770000000000001,1.1092,0.82750000000000001,0.98240000000000005,1.4086000000000001,1.7747999999999999]
[null,null,null,null,null,null,null,null,null,null,null,60.5,0.82625000000000004,0.98109999999999997,0.80600000000000005,0.85560000000000003,0.84650000000000003,1.1077999999999999,0.82625000000000004,0.98109999999999997,1.405,1.7724]
[null,null,null,null,null,null,null,null,null,null,null,60.6,0.82489999999999997,0.97975000000000001,0.80459999999999998,0.85440000000000005,0.84519999999999995,1.1063000000000001,0.82489999999999997,0.97975000000000001,1.4021999999999999,1.77]
[null,null,null,null,null,null,null,null,null,null,null,60.7,0.8236,0.97845000000000004,0.80330000000000001,0.85319999999999996,0.84389999999999998,1.1049,0.8236,0.97845000000000004,1.3994,1.7676000000000001]
[null,null,null,null,null,null,null,null,null,null,null,60.8,0.82230000000000003,0.97714999999999996,0.80189999999999995,0.85199999999999998,0.8427,1.1034999999999999,0.82230000000000003,0.97714999999999996,1.3965999999999998,1.7652000000000001]
[null,null,null,null,null,null,null,null,null,null,null,60.9,0.82784999999999997,0.97589999999999999,0.81420000000000003,0.8508,0.84150000000000003,1.1021000000000001,0.82784999999999997,0.97589999999999999,1.3937999999999999,1.7625999999999999]
[null,null,null,null,null,null,null,null,null,null,null,61,0.81974999999999998,0.97460000000000002,0.79930000000000001,0.84970000000000001,0.84019999999999995,1.1007,0.81974999999999998,0.97460000000000002,1.391,1.7598]
[null,null,null,null,null,null,null,null,null,null,null,61.1,0.81845000000000001,0.97335000000000005,0.79790000000000005,0.84850000000000003,0.83899999999999997,1.0993999999999999,0.81845000000000001,0.97335000000000005,1.3881999999999999,1.7569999999999999]
[null,null,null,null,null,null,null,null,null,null,null,61.2,0.81719999999999993,0.97209999999999996,0.79659999999999997,0.84730000000000005,0.83779999999999999,1.0980000000000001,0.81719999999999993,0.97209999999999996,1.3854,1.7545999999999999]
[null,null,null,null,null,null,null,null,null,null,null,61.3,0.81590000000000007,0.9708,0.79530000000000001,0.84619999999999995,0.83650000000000002,1.0966,0.81590000000000007,0.9708,1.3825999999999998,1.7522]
[null,null,null,null,null,null,null,null,null,null,null,61.4,0.8146500000000001,0.96950000000000003,0.79400000000000004,0.84499999999999997,0.83530000000000004,1.0952,0.8146500000000001,0.96950000000000003,1.3797999999999999,1.7498]
[null,null,null,null,null,null,null,null,null,null,null,61.5,0.8133999999999999,0.96830000000000005,0.79269999999999996,0.84379999999999999,0.83409999999999995,1.0939000000000001,0.8133999999999999,0.96830000000000005,1.377,1.7474000000000001]
[null,null,null,null,null,null,null,null,null,null,null,61.6,0.81220000000000003,0.96699999999999997,0.79149999999999998,0.8427,0.83289999999999997,1.0925,0.81220000000000003,0.96699999999999997,1.3746,1.7450000000000001]
[null,null,null,null,null,null,null,null,null,null,null,61.7,0.81095000000000006,0.96575,0.79020000000000001,0.84150000000000003,0.83169999999999999,1.0911,0.81095000000000006,0.96575,1.3722000000000001,1.7430000000000001]
[null,null,null,null,null,null,null,null,null,null,null,61.8,0.80970000000000009,0.96450000000000002,0.78890000000000005,0.84040000000000004,0.83050000000000002,1.0898000000000001,0.80970000000000009,0.96450000000000002,1.3695999999999999,1.7410000000000001]
[null,null,null,null,null,null,null,null,null,null,null,61.9,0.81495000000000006,0.96325000000000005,0.80059999999999998,0.83919999999999995,0.82930000000000004,1.0884,0.81495000000000006,0.96325000000000005,1.3668,1.7390000000000001]
[null,null,null,null,null,null,null,null,null,null,null,62,0.80725000000000002,0.96204999999999996,0.78639999999999999,0.83809999999999996,0.82809999999999995,1.0871,0.80725000000000002,0.96204999999999996,1.3640000000000001,1.7370000000000001]
[null,null,null,null,null,null,null,null,null,null,null,62.1,0.80604999999999993,0.96079999999999999,0.78510000000000002,0.83699999999999997,0.82699999999999996,1.0858000000000001,0.80604999999999993,0.96079999999999999,1.3612,1.7350000000000001]
[null,null,null,null,null,null,null,null,null,null,null,62.2,0.80485000000000007,0.95955000000000001,0.78390000000000004,0.83579999999999999,0.82579999999999998,1.0844,0.80485000000000007,0.95955000000000001,1.3584000000000001,1.7330000000000001]
[null,null,null,null,null,null,null,null,null,null,null,62.3,0.80359999999999998,0.95835000000000004,0.78259999999999996,0.8347,0.8246,1.0831,0.80359999999999998,0.95835000000000004,1.3555999999999999,1.7310000000000001]
[null,null,null,null,null,null,null,null,null,null,null,62.4,0.80245,0.95709999999999995,0.78139999999999998,0.83360000000000001,0.82350000000000001,1.0818000000000001,0.80245,0.95709999999999995,1.3528,1.7290000000000001]
[null,null,null,null,null,null,null,null,null,null,null,62.5,0.80125000000000002,0.95589999999999997,0.7802,0.83240000000000003,0.82230000000000003,1.0805,0.80125000000000002,0.95589999999999997,1.35,1.7270000000000001]
[null,null,null,null,null,null,null,null,null,null,null,62.6,0.80005000000000004,0.95469999999999999,0.77890000000000004,0.83130000000000004,0.82120000000000004,1.0791999999999999,0.80005000000000004,0.95469999999999999,1.3472,1.7250000000000001]
[null,null,null,null,null,null,null,null,null,null,null,62.7,0.79884999999999995,0.95350000000000001,0.77769999999999995,0.83020000000000005,0.82,1.0779000000000001,0.79884999999999995,0.95350000000000001,1.3444,1.7230000000000001]
[null,null,null,null,null,null,null,null,null,null,null,62.8,0.79769999999999996,0.95225000000000004,0.77649999999999997,0.82909999999999995,0.81889999999999996,1.0765,0.79769999999999996,0.95225000000000004,1.3415999999999999,1.7210000000000001]
[null,null,null,null,null,null,null,null,null,null,null,62.9,0.80269999999999997,0.95109999999999995,0.78759999999999997,0.82799999999999996,0.81779999999999997,1.0752999999999999,0.80269999999999997,0.95109999999999995,1.3388,1.7190000000000001]
[null,null,null,null,null,null,null,null,null,null,null,63,0.79535,0.94984999999999997,0.77410000000000001,0.82689999999999997,0.81659999999999999,1.0740000000000001,0.79535,0.94984999999999997,1.3360000000000001,1.7170000000000001]
[null,null,null,null,null,null,null,null,null,null,null,63.1,0.79420000000000002,0.94864999999999999,0.77290000000000003,0.82569999999999999,0.8155,1.0727,0.79420000000000002,0.94864999999999999,1.3331999999999999,1.7150000000000001]
[null,null,null,null,null,null,null,null,null,null,null,63.2,0.79305000000000003,0.94745000000000001,0.77170000000000005,0.8246,0.81440000000000001,1.0713999999999999,0.79305000000000003,0.94745000000000001,1.3304,1.7134]
[null,null,null,null,null,null,null,null,null,null,null,63.3,0.79194999999999993,0.94625000000000004,0.77059999999999995,0.82350000000000001,0.81330000000000002,1.0701000000000001,0.79194999999999993,0.94625000000000004,1.3275999999999999,1.7118]
[null,null,null,null,null,null,null,null,null,null,null,63.4,0.79079999999999995,0.94504999999999995,0.76939999999999997,0.82240000000000002,0.81220000000000003,1.0688,0.79079999999999995,0.94504999999999995,1.3248,1.7102000000000002]
[null,null,null,null,null,null,null,null,null,null,null,63.5,0.78964999999999996,0.94389999999999996,0.76819999999999999,0.82130000000000003,0.81110000000000004,1.0676000000000001,0.78964999999999996,0.94389999999999996,1.3220000000000001,1.7086000000000001]
[null,null,null,null,null,null,null,null,null,null,null,63.6,0.78855000000000008,0.94274999999999998,0.7671,0.82020000000000004,0.81,1.0663,0.78855000000000008,0.94274999999999998,1.32,1.7070000000000001]
[null,null,null,null,null,null,null,null,null,null,null,63.7,0.78739999999999999,0.94155,0.76590000000000003,0.81920000000000004,0.80889999999999995,1.0649999999999999,0.78739999999999999,0.94155,1.3180000000000001,1.7054]
[null,null,null,null,null,null,null,null,null,null,null,63.8,0.78625,0.94040000000000001,0.76470000000000005,0.81810000000000005,0.80779999999999996,1.0638000000000001,0.78625,0.94040000000000001,1.3157999999999999,1.7038]
[null,null,null,null,null,null,null,null,null,null,null,63.9,0.79099999999999993,0.93920000000000003,0.77529999999999999,0.81699999999999995,0.80669999999999997,1.0625,0.79099999999999993,0.93920000000000003,1.3133999999999999,1.702]
[null,null,null,null,null,null,null,null,null,null,null,64,0.78410000000000002,0.93805000000000005,0.76249999999999996,0.81589999999999996,0.80569999999999997,1.0612999999999999,0.78410000000000002,0.93805000000000005,1.3109999999999999,1.7]
[null,null,null,null,null,null,null,null,null,null,null,64.099999999999994,0.78295000000000003,0.93735000000000002,0.76129999999999998,0.81479999999999997,0.80459999999999998,1.0601,0.78295000000000003,0.93735000000000002,1.3089999999999999,1.698]
[null,null,null,null,null,null,null,null,null,null,null,64.2,0.78184999999999993,0.93574999999999997,0.76019999999999999,0.81369999999999998,0.80349999999999999,1.0588,0.78184999999999993,0.93574999999999997,1.3069999999999999,1.6963999999999999]
[null,null,null,null,null,null,null,null,null,null,null,64.3,0.78079999999999994,0.93459999999999999,0.7591,0.81269999999999998,0.80249999999999999,1.0576000000000001,0.78079999999999994,0.93459999999999999,1.3048,1.6947999999999999]
[null,null,null,null,null,null,null,null,null,null,null,64.400000000000006,0.77970000000000006,0.93345,0.75800000000000001,0.81159999999999999,0.8014,1.0564,0.77970000000000006,0.93345,1.3024,1.6932]
[null,null,null,null,null,null,null,null,null,null,null,64.5,0.7792,0.93230000000000002,0.75800000000000001,0.8105,0.8004,1.0550999999999999,0.7792,0.93230000000000002,1.3,1.6916]
[null,null,null,null,null,null,null,null,null,null,null,64.599999999999994,0.77749999999999997,0.93115000000000003,0.75570000000000004,0.8095,0.79930000000000001,1.0539000000000001,0.77749999999999997,0.93115000000000003,1.298,1.69]
[null,null,null,null,null,null,null,null,null,null,null,64.7,0.77645000000000008,0.93,0.75460000000000005,0.80840000000000001,0.79830000000000001,1.0527,0.77645000000000008,0.93,1.296,1.6883999999999999]
[null,null,null,null,null,null,null,null,null,null,null,64.8,0.77539999999999998,0.92889999999999995,0.75349999999999995,0.80730000000000002,0.79730000000000001,1.0515000000000001,0.77539999999999998,0.92889999999999995,1.294,1.6867999999999999]
[null,null,null,null,null,null,null,null,null,null,null,64.900000000000006,0.77990000000000004,0.92774999999999996,0.76359999999999995,0.80630000000000002,0.79620000000000002,1.0503,0.77990000000000004,0.92774999999999996,1.292,1.6850000000000001]
[null,null,null,null,null,null,null,null,null,null,null,65,0.77329999999999999,0.92664999999999997,0.75139999999999996,0.80520000000000003,0.79520000000000002,1.0490999999999999,0.77329999999999999,0.92664999999999997,1.29,1.6830000000000001]
[null,null,null,null,null,null,null,null,null,null,null,65.099999999999994,0.77224999999999999,0.92549999999999999,0.75029999999999997,0.80420000000000003,0.79420000000000002,1.0479000000000001,0.77224999999999999,0.92549999999999999,1.2876000000000001,1.681]
[null,null,null,null,null,null,null,null,null,null,null,65.2,0.7712,0.9244,0.74919999999999998,0.80310000000000004,0.79320000000000002,1.0467,0.7712,0.9244,1.2852000000000001,1.679]
[null,null,null,null,null,null,null,null,null,null,null,65.3,0.77015,0.92325000000000002,0.74809999999999999,0.80210000000000004,0.79220000000000002,1.0455000000000001,0.77015,0.92325000000000002,1.2829999999999999,1.677]
[null,null,null,null,null,null,null,null,null,null,null,65.400000000000006,0.76910000000000001,0.92220000000000002,0.74709999999999999,0.80100000000000005,0.79110000000000003,1.0444,0.76910000000000001,0.92220000000000002,1.2809999999999999,1.6752]
[null,null,null,null,null,null,null,null,null,null,null,65.5,0.76805000000000001,0.92110000000000003,0.746,0.8,0.79010000000000002,1.0431999999999999,0.76805000000000001,0.92110000000000003,1.2789999999999999,1.6736]
[null,null,null,null,null,null,null,null,null,null,null,65.599999999999994,0.76705000000000001,0.91995000000000005,0.745,0.79900000000000004,0.78910000000000002,1.042,0.76705000000000001,0.91995000000000005,1.2766,1.6719999999999999]
[null,null,null,null,null,null,null,null,null,null,null,65.7,0.76600000000000001,0.91884999999999994,0.74390000000000001,0.79790000000000005,0.78810000000000002,1.0407999999999999,0.76600000000000001,0.91884999999999994,1.2742,1.6703999999999999]
[null,null,null,null,null,null,null,null,null,null,null,65.8,0.76505000000000001,0.91779999999999995,0.7429,0.79690000000000005,0.78720000000000001,1.0397000000000001,0.76505000000000001,0.91779999999999995,1.272,1.6687999999999998]
[null,null,null,null,null,null,null,null,null,null,null,65.900000000000006,0.76929999999999998,0.91664999999999996,0.75239999999999996,0.79590000000000005,0.78620000000000001,1.0385,0.76929999999999998,0.91664999999999996,1.27,1.6672]
[null,null,null,null,null,null,null,null,null,null,null,66,0.76300000000000001,0.91559999999999997,0.74080000000000001,0.79479999999999995,0.78520000000000001,1.0374000000000001,0.76300000000000001,0.91559999999999997,1.268,1.6656]
[null,null,null,null,null,null,null,null,null,null,null,66.099999999999994,0.76200000000000001,0.91449999999999998,0.73980000000000001,0.79379999999999995,0.78420000000000001,1.0362,0.76200000000000001,0.91449999999999998,1.266,1.6639999999999999]
[null,null,null,null,null,null,null,null,null,null,null,66.2,0.76095000000000002,0.91344999999999998,0.73870000000000002,0.79279999999999995,0.78320000000000001,1.0350999999999999,0.76095000000000002,0.91344999999999998,1.264,1.6623999999999999]
[null,null,null,null,null,null,null,null,null,null,null,66.3,0.76,0.91234999999999999,0.73770000000000002,0.79179999999999995,0.7823,1.0339,0.76,0.91234999999999999,1.2617999999999998,1.6607999999999998]
[null,null,null,null,null,null,null,null,null,null,null,66.400000000000006,0.75900000000000001,0.9113,0.73670000000000002,0.79079999999999995,0.78129999999999999,1.0327999999999999,0.75900000000000001,0.9113,1.2593999999999999,1.659]
[null,null,null,null,null,null,null,null,null,null,null,66.5,0.75805,0.91020000000000001,0.73570000000000002,0.78979999999999995,0.78039999999999998,1.0317000000000001,0.75805,0.91020000000000001,1.2569999999999999,1.657]
[null,null,null,null,null,null,null,null,null,null,null,66.599999999999994,0.75705,0.90915000000000001,0.73470000000000002,0.78869999999999996,0.77939999999999998,1.0306,0.75705,0.90915000000000001,1.2549999999999999,1.655]
[null,null,null,null,null,null,null,null,null,null,null,66.7,0.75609999999999999,0.90805000000000002,0.73370000000000002,0.78769999999999996,0.77849999999999997,1.0294000000000001,0.75609999999999999,0.90805000000000002,1.2529999999999999,1.6534]
[null,null,null,null,null,null,null,null,null,null,null,66.8,0.75509999999999999,0.90700000000000003,0.73270000000000002,0.78669999999999995,0.77749999999999997,1.0283,0.75509999999999999,0.90700000000000003,1.2507999999999999,1.6517999999999999]
[null,null,null,null,null,null,null,null,null,null,null,66.900000000000006,0.75919999999999999,0.90595000000000003,0.74180000000000001,0.78569999999999995,0.77659999999999996,1.0271999999999999,0.75919999999999999,0.90595000000000003,1.2484,1.6502000000000001]
[null,null,null,null,null,null,null,null,null,null,null,67,0.75314999999999999,0.90490000000000004,0.73070000000000002,0.78469999999999995,0.77559999999999996,1.0261,0.75314999999999999,0.90490000000000004,1.246,1.6486000000000001]
[null,null,null,null,null,null,null,null,null,null,null,67.099999999999994,0.75219999999999998,0.90385000000000004,0.72970000000000002,0.78369999999999995,0.77470000000000006,1.0249999999999999,0.75219999999999998,0.90385000000000004,1.2444,1.647]
[null,null,null,null,null,null,null,null,null,null,null,67.2,0.75124999999999997,0.90280000000000005,0.72870000000000001,0.78269999999999995,0.77380000000000004,1.0239,0.75124999999999997,0.90280000000000005,1.2427999999999999,1.6454]
[null,null,null,null,null,null,null,null,null,null,null,67.3,0.75035000000000007,0.90175000000000005,0.7278,0.78169999999999995,0.77290000000000003,1.0227999999999999,0.75035000000000007,0.90175000000000005,1.2410000000000001,1.6437999999999999]
[null,null,null,null,null,null,null,null,null,null,null,67.400000000000006,0.74934999999999996,0.90075000000000005,0.7268,0.78069999999999995,0.77190000000000003,1.0217000000000001,0.74934999999999996,0.90075000000000005,1.2390000000000001,1.6422000000000001]
[null,null,null,null,null,null,null,null,null,null,null,67.5,0.74839999999999995,0.89995000000000003,0.7258,0.77980000000000005,0.77100000000000002,1.0206,0.74839999999999995,0.89995000000000003,1.2370000000000001,1.6406000000000001]
[null,null,null,null,null,null,null,null,null,null,null,67.599999999999994,0.74750000000000005,0.8982,0.72489999999999999,0.77769999999999995,0.77010000000000001,1.0195000000000001,0.74750000000000005,0.8982,1.2354000000000001,1.639]
[null,null,null,null,null,null,null,null,null,null,null,67.7,0.74655000000000005,0.89729999999999999,0.72389999999999999,0.77690000000000003,0.76919999999999999,1.0185,0.74655000000000005,0.89729999999999999,1.2338,1.637]
[null,null,null,null,null,null,null,null,null,null,null,67.8,0.74564999999999992,0.89634999999999998,0.72299999999999998,0.77610000000000001,0.76829999999999998,1.0174000000000001,0.74564999999999992,0.89634999999999998,1.232,1.635]
[null,null,null,null,null,null,null,null,null,null,null,67.900000000000006,0.74954999999999994,0.89539999999999997,0.73170000000000002,0.77529999999999999,0.76739999999999997,1.0163,0.74954999999999994,0.89539999999999997,1.23,1.6334]
[null,null,null,null,null,null,null,null,null,null,null,68,0.74380000000000002,0.89449999999999996,0.72109999999999996,0.77449999999999997,0.76649999999999996,1.0153000000000001,0.74380000000000002,0.89449999999999996,1.228,1.6321999999999999]
[null,null,null,null,null,null,null,null,null,null,null,68.099999999999994,0.74285000000000001,0.89354999999999996,0.72009999999999996,0.77370000000000005,0.76559999999999995,1.0142,0.74285000000000001,0.89354999999999996,1.2263999999999999,1.631]
[null,null,null,null,null,null,null,null,null,null,null,68.2,0.74195,0.89259999999999995,0.71919999999999995,0.77290000000000003,0.76470000000000005,1.0130999999999999,0.74195,0.89259999999999995,1.2247999999999999,1.6294]
[null,null,null,null,null,null,null,null,null,null,null,68.3,0.74104999999999999,0.89170000000000005,0.71830000000000005,0.77210000000000001,0.76380000000000003,1.0121,0.74104999999999999,0.89170000000000005,1.2230000000000001,1.6277999999999999]
[null,null,null,null,null,null,null,null,null,null,null,68.400000000000006,0.74019999999999997,0.89075000000000004,0.71740000000000004,0.77129999999999999,0.76300000000000001,1.0109999999999999,0.74019999999999997,0.89075000000000004,1.2210000000000001,1.6262000000000001]
[null,null,null,null,null,null,null,null,null,null,null,68.5,0.73924999999999996,0.88985000000000003,0.71640000000000004,0.77049999999999996,0.7621,1.01,0.73924999999999996,0.88985000000000003,1.2190000000000001,1.6246]
[null,null,null,null,null,null,null,null,null,null,null,68.599999999999994,0.73835000000000006,0.88895000000000002,0.71550000000000002,0.76970000000000005,0.76119999999999999,1.0089999999999999,0.73835000000000006,0.88895000000000002,1.2174,1.623]
[null,null,null,null,null,null,null,null,null,null,null,68.7,0.73744999999999994,0.88805000000000001,0.71460000000000001,0.76890000000000003,0.76029999999999998,1.0079,0.73744999999999994,0.88805000000000001,1.2158,1.6218000000000001]
[null,null,null,null,null,null,null,null,null,null,null,68.8,0.73659999999999992,0.88714999999999999,0.7137,0.76819999999999999,0.75949999999999995,1.0068999999999999,0.73659999999999992,0.88714999999999999,1.214,1.6206]
[null,null,null,null,null,null,null,null,null,null,null,68.900000000000006,0.74029999999999996,0.88624999999999998,0.72199999999999998,0.76739999999999997,0.75860000000000005,1.0059,0.74029999999999996,0.88624999999999998,1.212,1.6196000000000002]
[null,null,null,null,null,null,null,null,null,null,null,69,0.73485,0.88529999999999998,0.71189999999999998,0.76659999999999995,0.75780000000000003,1.0047999999999999,0.73485,0.88529999999999998,1.21,1.6188]
[null,null,null,null,null,null,null,null,null,null,null,69.099999999999994,0.73394999999999999,0.88439999999999996,0.71099999999999997,0.76580000000000004,0.75690000000000002,1.0038,0.73394999999999999,0.88439999999999996,1.2083999999999999,1.6180000000000001]
[null,null,null,null,null,null,null,null,null,null,null,69.2,0.73309999999999997,0.88349999999999995,0.71009999999999995,0.76500000000000001,0.75609999999999999,1.0027999999999999,0.73309999999999997,0.88349999999999995,1.2067999999999999,1.6168]
[null,null,null,null,null,null,null,null,null,null,null,69.3,0.73219999999999996,0.88265000000000005,0.70920000000000005,0.76419999999999999,0.75519999999999998,1.0018,0.73219999999999996,0.88265000000000005,1.2052,1.6155999999999999]
[null,null,null,null,null,null,null,null,null,null,null,69.400000000000006,0.73134999999999994,0.88175000000000003,0.70830000000000004,0.76349999999999996,0.75439999999999996,1.0007999999999999,0.73134999999999994,0.88175000000000003,1.2036,1.6144000000000001]
[null,null,null,null,null,null,null,null,null,null,null,69.5,0.73045000000000004,0.88085000000000002,0.70740000000000003,0.76270000000000004,0.75349999999999995,0.99980000000000002,0.73045000000000004,0.88085000000000002,1.202,1.6132]
[null,null,null,null,null,null,null,null,null,null,null,69.599999999999994,0.72965000000000002,0.87995000000000001,0.70660000000000001,0.76190000000000002,0.75270000000000004,0.99880000000000002,0.72965000000000002,0.87995000000000001,1.2003999999999999,1.6120000000000001]
[null,null,null,null,null,null,null,null,null,null,null,69.7,0.7288,0.87909999999999999,0.70569999999999999,0.7611,0.75190000000000001,0.99780000000000002,0.7288,0.87909999999999999,1.1987999999999999,1.6104000000000001]
[null,null,null,null,null,null,null,null,null,null,null,69.8,0.72789999999999999,0.87819999999999998,0.70479999999999998,0.76039999999999996,0.751,0.99680000000000002,0.72789999999999999,0.87819999999999998,1.1972,1.6088]
[null,null,null,null,null,null,null,null,null,null,null,69.900000000000006,0.73150000000000004,0.87729999999999997,0.71279999999999999,0.75960000000000005,0.75019999999999998,0.99580000000000002,0.73150000000000004,0.87729999999999997,1.1956,1.6074000000000002]
[null,null,null,null,null,null,null,null,null,null,null,70,0.72624999999999995,0.87644999999999995,0.70309999999999995,0.75880000000000003,0.74939999999999996,0.99480000000000002,0.72624999999999995,0.87644999999999995,1.194,1.6062000000000001]
[null,null,null,null,null,null,null,null,null,null,null,70.099999999999994,0.72540000000000004,0.87560000000000004,0.70220000000000005,0.7581,0.74860000000000004,0.99390000000000001,0.72540000000000004,0.87560000000000004,1.1923999999999999,1.605]
[null,null,null,null,null,null,null,null,null,null,null,70.2,0.72460000000000002,0.87470000000000003,0.70140000000000002,0.75729999999999997,0.74780000000000002,0.9929,0.72460000000000002,0.87470000000000003,1.1907999999999999,1.6033999999999999]
[null,null,null,null,null,null,null,null,null,null,null,70.3,0.72370000000000001,0.87385000000000002,0.70050000000000001,0.75649999999999995,0.74690000000000001,0.9919,0.72370000000000001,0.87385000000000002,1.1892,1.6017999999999999]
[null,null,null,null,null,null,null,null,null,null,null,70.400000000000006,0.72289999999999999,0.873,0.69969999999999999,0.75580000000000003,0.74609999999999999,0.99099999999999999,0.72289999999999999,0.873,1.1876,1.6004]
[null,null,null,null,null,null,null,null,null,null,null,70.5,0.72209999999999996,0.87214999999999998,0.69889999999999997,0.755,0.74529999999999996,0.99,0.72209999999999996,0.87214999999999998,1.1859999999999999,1.5992]
[null,null,null,null,null,null,null,null,null,null,null,70.599999999999994,0.72124999999999995,0.87124999999999997,0.69799999999999995,0.75429999999999997,0.74450000000000005,0.98899999999999999,0.72124999999999995,0.87124999999999997,1.1843999999999999,1.5980000000000001]
[null,null,null,null,null,null,null,null,null,null,null,70.7,0.72045000000000003,0.87039999999999995,0.69720000000000004,0.75349999999999995,0.74370000000000003,0.98809999999999998,0.72045000000000003,0.87039999999999995,1.1827999999999999,1.5968]
[null,null,null,null,null,null,null,null,null,null,null,70.8,0.71970000000000001,0.86955000000000005,0.69640000000000002,0.75270000000000004,0.74299999999999999,0.98709999999999998,0.71970000000000001,0.86955000000000005,1.1812,1.5955999999999999]
[null,null,null,null,null,null,null,null,null,null,null,70.900000000000006,0.72309999999999997,0.86870000000000003,0.70399999999999996,0.752,0.74219999999999997,0.98619999999999997,0.72309999999999997,0.86870000000000003,1.1796,1.5944]
[null,null,null,null,null,null,null,null,null,null,null,71,0.71804999999999997,0.86785000000000001,0.69469999999999998,0.75119999999999998,0.74139999999999995,0.98519999999999996,0.71804999999999997,0.86785000000000001,1.1779999999999999,1.5931999999999999]
[null,null,null,null,null,null,null,null,null,null,null,71.099999999999994,0.71724999999999994,0.86699999999999999,0.69389999999999996,0.75049999999999994,0.74060000000000004,0.98429999999999995,0.71724999999999994,0.86699999999999999,1.1763999999999999,1.5920000000000001]
[null,null,null,null,null,null,null,null,null,null,null,71.2,0.71645000000000003,0.86619999999999997,0.69310000000000005,0.74970000000000003,0.73980000000000001,0.98340000000000005,0.71645000000000003,0.86619999999999997,1.1747999999999998,1.5908]
[null,null,null,null,null,null,null,null,null,null,null,71.3,0.71565000000000001,0.86529999999999996,0.69230000000000003,0.749,0.73899999999999999,0.98240000000000005,0.71565000000000001,0.86529999999999996,1.1732,1.5895999999999999]
[null,null,null,null,null,null,null,null,null,null,null,71.400000000000006,0.71484999999999999,0.86450000000000005,0.69140000000000001,0.74819999999999998,0.73829999999999996,0.98150000000000004,0.71484999999999999,0.86450000000000005,1.1716,1.5884]
[null,null,null,null,null,null,null,null,null,null,null,71.5,0.71405000000000007,0.86370000000000002,0.69059999999999999,0.74750000000000005,0.73750000000000004,0.98060000000000003,0.71405000000000007,0.86370000000000002,1.17,1.5871999999999999]
[null,null,null,null,null,null,null,null,null,null,null,71.599999999999994,0.71324999999999994,0.86285000000000001,0.68979999999999997,0.74680000000000002,0.73670000000000002,0.97970000000000002,0.71324999999999994,0.86285000000000001,1.1683999999999999,1.5860000000000001]
[null,null,null,null,null,null,null,null,null,null,null,71.7,0.71250000000000002,0.86204999999999998,0.68899999999999995,0.746,0.73599999999999999,0.9788,0.71250000000000002,0.86204999999999998,1.1667999999999998,1.5848]
[null,null,null,null,null,null,null,null,null,null,null,71.8,0.7117,0.86119999999999997,0.68820000000000003,0.74529999999999996,0.73519999999999996,0.97789999999999999,0.7117,0.86119999999999997,1.1652,1.5835999999999999]
[null,null,null,null,null,null,null,null,null,null,null,71.900000000000006,0.71499999999999997,0.86034999999999995,0.69550000000000001,0.74450000000000005,0.73450000000000004,0.97689999999999999,0.71499999999999997,0.86034999999999995,1.1636,1.5824]
[null,null,null,null,null,null,null,null,null,null,null,72,0.71019999999999994,0.85955000000000004,0.68669999999999998,0.74380000000000002,0.73370000000000002,0.97599999999999998,0.71019999999999994,0.85955000000000004,1.1619999999999999,1.5811999999999999]
[null,null,null,null,null,null,null,null,null,null,null,72.099999999999994,0.70944999999999991,0.85870000000000002,0.68589999999999995,0.74309999999999998,0.73299999999999998,0.97509999999999997,0.70944999999999991,0.85870000000000002,1.1603999999999999,1.58]
[null,null,null,null,null,null,null,null,null,null,null,72.2,0.70865,0.8579,0.68510000000000004,0.74229999999999996,0.73219999999999996,0.97419999999999995,0.70865,0.8579,1.1587999999999998,1.5788]
[null,null,null,null,null,null,null,null,null,null,null,72.3,0.70789999999999997,0.85714999999999997,0.68430000000000002,0.74160000000000004,0.73150000000000004,0.97340000000000004,0.70789999999999997,0.85714999999999997,1.1574,1.5775999999999999]
[null,null,null,null,null,null,null,null,null,null,null,72.400000000000006,0.70710000000000006,0.85629999999999995,0.6835,0.7409,0.73070000000000002,0.97250000000000003,0.70710000000000006,0.85629999999999995,1.1561999999999999,1.5764]
[null,null,null,null,null,null,null,null,null,null,null,72.5,0.70639999999999992,0.85550000000000004,0.68279999999999996,0.74009999999999998,0.73,0.97160000000000002,0.70639999999999992,0.85550000000000004,1.155,1.5751999999999999]
[null,null,null,null,null,null,null,null,null,null,null,72.599999999999994,0.70565,0.85470000000000002,0.68200000000000005,0.73939999999999995,0.72929999999999995,0.97070000000000001,0.70565,0.85470000000000002,1.1534,1.5740000000000001]
[null,null,null,null,null,null,null,null,null,null,null,72.7,0.70484999999999998,0.85385,0.68120000000000003,0.73870000000000002,0.72850000000000004,0.9698,0.70484999999999998,0.85385,1.1517999999999999,1.5728]
[null,null,null,null,null,null,null,null,null,null,null,72.8,0.70415000000000005,0.85304999999999997,0.68049999999999999,0.7379,0.7278,0.96889999999999998,0.70415000000000005,0.85304999999999997,1.1502000000000001,1.5715999999999999]
[null,null,null,null,null,null,null,null,null,null,null,72.900000000000006,0.70724999999999993,0.85229999999999995,0.68740000000000001,0.73719999999999997,0.72709999999999997,0.96809999999999996,0.70724999999999993,0.85229999999999995,1.1486000000000001,1.5702]
[null,null,null,null,null,null,null,null,null,null,null,73,0.70265,0.85150000000000003,0.67889999999999995,0.73650000000000004,0.72640000000000005,0.96719999999999995,0.70265,0.85150000000000003,1.147,1.5686]
[null,null,null,null,null,null,null,null,null,null,null,73.099999999999994,0.70189999999999997,0.85070000000000001,0.67820000000000003,0.73580000000000001,0.72560000000000002,0.96630000000000005,0.70189999999999997,0.85070000000000001,1.1454,1.5669999999999999]
[null,null,null,null,null,null,null,null,null,null,null,73.2,0.70114999999999994,0.84989999999999999,0.6774,0.73509999999999998,0.72489999999999999,0.96550000000000002,0.70114999999999994,0.84989999999999999,1.1437999999999999,1.5658000000000001]
[null,null,null,null,null,null,null,null,null,null,null,73.3,0.70045000000000002,0.84909999999999997,0.67669999999999997,0.73429999999999995,0.72419999999999995,0.96460000000000001,0.70045000000000002,0.84909999999999997,1.1422000000000001,1.5646]
[null,null,null,null,null,null,null,null,null,null,null,73.400000000000006,0.69975000000000009,0.84835000000000005,0.67600000000000005,0.73360000000000003,0.72350000000000003,0.96379999999999999,0.69975000000000009,0.84835000000000005,1.1406000000000001,1.5634000000000001]
[null,null,null,null,null,null,null,null,null,null,null,73.5,0.69900000000000007,0.84755000000000003,0.67520000000000002,0.7329,0.7228,0.96289999999999998,0.69900000000000007,0.84755000000000003,1.139,1.5622]
[null,null,null,null,null,null,null,null,null,null,null,73.599999999999994,0.69829999999999992,0.8468,0.67449999999999999,0.73219999999999996,0.72209999999999996,0.96209999999999996,0.69829999999999992,0.8468,1.1377999999999999,1.5609999999999999]
[null,null,null,null,null,null,null,null,null,null,null,73.7,0.69755,0.84604999999999997,0.67369999999999997,0.73150000000000004,0.72140000000000004,0.96130000000000004,0.69755,0.84604999999999997,1.1365999999999998,1.5598000000000001]
[null,null,null,null,null,null,null,null,null,null,null,73.8,0.69684999999999997,0.84524999999999995,0.67300000000000004,0.73080000000000001,0.72070000000000001,0.96040000000000003,0.69684999999999997,0.84524999999999995,1.1352,1.5586]
[null,null,null,null,null,null,null,null,null,null,null,73.900000000000006,0.69984999999999997,0.84445000000000003,0.67969999999999997,0.73009999999999997,0.72,0.95960000000000001,0.69984999999999997,0.84445000000000003,1.1335999999999999,1.5574000000000001]
[null,null,null,null,null,null,null,null,null,null,null,74,0.69545000000000001,0.84365000000000001,0.67159999999999997,0.72929999999999995,0.71930000000000005,0.9587,0.69545000000000001,0.84365000000000001,1.1319999999999999,1.5562]
[null,null,null,null,null,null,null,null,null,null,null,74.099999999999994,0.69469999999999998,0.84289999999999998,0.67079999999999995,0.72860000000000003,0.71860000000000002,0.95789999999999997,0.69469999999999998,0.84289999999999998,1.1303999999999998,1.5549999999999999]
[null,null,null,null,null,null,null,null,null,null,null,74.2,0.69399999999999995,0.84214999999999995,0.67010000000000003,0.72789999999999999,0.71789999999999998,0.95709999999999995,0.69399999999999995,0.84214999999999995,1.1287999999999998,1.5538000000000001]
[null,null,null,null,null,null,null,null,null,null,null,74.3,0.69335000000000002,0.84140000000000004,0.6694,0.72650000000000003,0.71730000000000005,0.95630000000000004,0.69335000000000002,0.84140000000000004,1.1272,1.5526]
[null,null,null,null,null,null,null,null,null,null,null,74.400000000000006,0.69264999999999999,0.84065000000000001,0.66869999999999996,0.7258,0.71660000000000001,0.95550000000000002,0.69264999999999999,0.84065000000000001,1.1255999999999999,1.5514000000000001]
[null,null,null,null,null,null,null,null,null,null,null,74.5,0.69195000000000007,0.83989999999999998,0.66800000000000004,0.72509999999999997,0.71589999999999998,0.95469999999999999,0.69195000000000007,0.83989999999999998,1.1240000000000001,1.5502]
[null,null,null,null,null,null,null,null,null,null,null,74.599999999999994,0.69125000000000003,0.83909999999999996,0.6673,0.72440000000000004,0.71519999999999995,0.95379999999999998,0.69125000000000003,0.83909999999999996,1.1224000000000001,1.5489999999999999]
[null,null,null,null,null,null,null,null,null,null,null,74.7,0.69059999999999999,0.83835000000000004,0.66659999999999997,0.72370000000000001,0.71460000000000001,0.95299999999999996,0.69059999999999999,0.83835000000000004,1.1208,1.5478000000000001]
[null,null,null,null,null,null,null,null,null,null,null,74.8,0.68989999999999996,0.83760000000000001,0.66590000000000005,0.72299999999999998,0.71389999999999998,0.95220000000000005,0.68989999999999996,0.83760000000000001,1.1194000000000002,1.5466]
[null,null,null,null,null,null,null,null,null,null,null,74.900000000000006,0.69274999999999998,0.83684999999999998,0.67230000000000001,0.72230000000000005,0.71319999999999995,0.95140000000000002,0.69274999999999998,0.83684999999999998,1.1182000000000001,1.5454000000000001]
[null,null,null,null,null,null,null,null,null,null,null,75,0.68855,0.83609999999999995,0.66449999999999998,0.72189999999999999,0.71260000000000001,0.9506,0.68855,0.83609999999999995,1.117,1.5442]
[null,null,null,null,null,null,null,null,null,null,null,75.099999999999994,0.68784999999999996,0.83535000000000004,0.66379999999999995,0.72160000000000002,0.71189999999999998,0.94979999999999998,0.68784999999999996,0.83535000000000004,1.1158000000000001,1.5429999999999999]
[null,null,null,null,null,null,null,null,null,null,null,75.2,0.68720000000000003,0.83465,0.66320000000000001,0.72089999999999999,0.71120000000000005,0.94910000000000005,0.68720000000000003,0.83465,1.1146,1.5422]
[null,null,null,null,null,null,null,null,null,null,null,75.3,0.6865,0.83394999999999997,0.66239999999999999,0.72019999999999995,0.71060000000000001,0.94830000000000003,0.6865,0.83394999999999997,1.1132000000000002,1.5413999999999999]
[null,null,null,null,null,null,null,null,null,null,null,75.400000000000006,0.68579999999999997,0.83320000000000005,0.66169999999999995,0.71960000000000002,0.70989999999999998,0.94750000000000001,0.68579999999999997,0.83320000000000005,1.1116000000000001,1.5406]
[null,null,null,null,null,null,null,null,null,null,null,75.5,0.68515000000000004,0.83245000000000002,0.66100000000000003,0.71889999999999998,0.70930000000000004,0.94669999999999999,0.68515000000000004,0.83245000000000002,1.1100000000000001,1.5397999999999998]
[null,null,null,null,null,null,null,null,null,null,null,75.599999999999994,0.68445,0.83169999999999999,0.6603,0.71819999999999995,0.70860000000000001,0.94589999999999996,0.68445,0.83169999999999999,1.1088,1.5389999999999999]
[null,null,null,null,null,null,null,null,null,null,null,75.7,0.68384999999999996,0.83099999999999996,0.65969999999999995,0.71750000000000003,0.70799999999999996,0.94520000000000004,0.68384999999999996,0.83099999999999996,1.1075999999999999,1.5378000000000001]
[null,null,null,null,null,null,null,null,null,null,null,75.8,0.68320000000000003,0.83025000000000004,0.65900000000000003,0.71679999999999999,0.70740000000000003,0.94440000000000002,0.68320000000000003,0.83025000000000004,1.1062000000000001,1.5366]
[null,null,null,null,null,null,null,null,null,null,null,75.900000000000006,0.68595000000000006,0.82950000000000002,0.66520000000000001,0.71609999999999996,0.70669999999999999,0.94359999999999999,0.68595000000000006,0.82950000000000002,1.1046,1.5356000000000001]
[null,null,null,null,null,null,null,null,null,null,null,76,0.68189999999999995,0.82884999999999998,0.65769999999999995,0.71540000000000004,0.70609999999999995,0.94289999999999996,0.68189999999999995,0.82884999999999998,1.103,1.5347999999999999]
[null,null,null,null,null,null,null,null,null,null,null,76.099999999999994,0.68125000000000002,0.82809999999999995,0.65700000000000003,0.71479999999999999,0.70550000000000002,0.94210000000000005,0.68125000000000002,0.82809999999999995,1.1018000000000001,1.534]
[null,null,null,null,null,null,null,null,null,null,null,76.2,0.68054999999999999,0.82740000000000002,0.65629999999999999,0.71409999999999996,0.70479999999999998,0.94140000000000001,0.68054999999999999,0.82740000000000002,1.1006,1.5327999999999999]
[null,null,null,null,null,null,null,null,null,null,null,76.3,0.67995000000000005,0.82665,0.65569999999999995,0.71340000000000003,0.70420000000000005,0.94059999999999999,0.67995000000000005,0.82665,1.0992000000000002,1.5315999999999999]
[null,null,null,null,null,null,null,null,null,null,null,76.400000000000006,0.67930000000000001,0.82594999999999996,0.65500000000000003,0.7127,0.7036,0.93989999999999996,0.67930000000000001,0.82594999999999996,1.0976000000000001,1.5306]
[null,null,null,null,null,null,null,null,null,null,null,76.5,0.67859999999999998,0.82525000000000004,0.65429999999999999,0.71199999999999997,0.70289999999999997,0.93910000000000005,0.67859999999999998,0.82525000000000004,1.0960000000000001,1.5297999999999998]
[null,null,null,null,null,null,null,null,null,null,null,76.599999999999994,0.67799999999999994,0.82455000000000001,0.65369999999999995,0.71140000000000003,0.70230000000000004,0.93840000000000001,0.67799999999999994,0.82455000000000001,1.0948,1.5289999999999999]
[null,null,null,null,null,null,null,null,null,null,null,76.7,0.67735000000000001,0.82379999999999998,0.65300000000000002,0.7107,0.70169999999999999,0.93759999999999999,0.67735000000000001,0.82379999999999998,1.0935999999999999,1.5278]
[null,null,null,null,null,null,null,null,null,null,null,76.8,0.67674999999999996,0.82315000000000005,0.65239999999999998,0.71,0.70109999999999995,0.93689999999999996,0.67674999999999996,0.82315000000000005,1.0924,1.5266]
[null,null,null,null,null,null,null,null,null,null,null,76.900000000000006,0.6794,0.82245000000000001,0.6583,0.70940000000000003,0.70050000000000001,0.93620000000000003,0.6794,0.82245000000000001,1.0911999999999999,1.5256000000000001]
[null,null,null,null,null,null,null,null,null,null,null,77,0.67549999999999999,0.82169999999999999,0.65110000000000001,0.7087,0.69989999999999997,0.93540000000000001,0.67549999999999999,0.82169999999999999,1.0900000000000001,1.5247999999999999]
[null,null,null,null,null,null,null,null,null,null,null,77.099999999999994,0.67490000000000006,0.82104999999999995,0.65049999999999997,0.70799999999999996,0.69930000000000003,0.93469999999999998,0.67490000000000006,0.82104999999999995,1.0888,1.524]
[null,null,null,null,null,null,null,null,null,null,null,77.2,0.67425000000000002,0.82035000000000002,0.64980000000000004,0.70740000000000003,0.69869999999999999,0.93400000000000005,0.67425000000000002,0.82035000000000002,1.0875999999999999,1.5227999999999999]
[null,null,null,null,null,null,null,null,null,null,null,77.3,0.67365000000000008,0.81964999999999999,0.6492,0.70669999999999999,0.69810000000000005,0.93330000000000002,0.67365000000000008,0.81964999999999999,1.0864,1.5215999999999998]
[null,null,null,null,null,null,null,null,null,null,null,77.400000000000006,0.67304999999999993,0.81899999999999995,0.64859999999999995,0.70599999999999996,0.69750000000000001,0.93259999999999998,0.67304999999999993,0.81899999999999995,1.0851999999999999,1.5206]
[null,null,null,null,null,null,null,null,null,null,null,77.5,0.6724,0.81825000000000003,0.64790000000000003,0.70540000000000003,0.69689999999999996,0.93179999999999996,0.6724,0.81825000000000003,1.0840000000000001,1.5197999999999998]
[null,null,null,null,null,null,null,null,null,null,null,77.599999999999994,0.67179999999999995,0.81755,0.64729999999999999,0.70469999999999999,0.69630000000000003,0.93110000000000004,0.67179999999999995,0.81755,1.0828,1.5189999999999999]
[null,null,null,null,null,null,null,null,null,null,null,77.7,0.67120000000000002,0.81689999999999996,0.64670000000000005,0.70399999999999996,0.69569999999999999,0.9304,0.67120000000000002,0.81689999999999996,1.0815999999999999,1.5182]
[null,null,null,null,null,null,null,null,null,null,null,77.8,0.67060000000000008,0.81620000000000004,0.64610000000000001,0.70340000000000003,0.69510000000000005,0.92969999999999997,0.67060000000000008,0.81620000000000004,1.0804,1.5173999999999999]
[null,null,null,null,null,null,null,null,null,null,null,77.900000000000006,0.67310000000000003,0.81555,0.65169999999999995,0.70269999999999999,0.69450000000000001,0.92900000000000005,0.67310000000000003,0.81555,1.0791999999999999,1.5165999999999999]
[null,null,null,null,null,null,null,null,null,null,null,78,0.66935,0.81484999999999996,0.64480000000000004,0.70209999999999995,0.69389999999999996,0.92830000000000001,0.66935,0.81484999999999996,1.0780000000000001,1.5157999999999998]
[null,null,null,null,null,null,null,null,null,null,null,78.099999999999994,0.66874999999999996,0.81415000000000004,0.64419999999999999,0.70140000000000002,0.69330000000000003,0.92759999999999998,0.66874999999999996,0.81415000000000004,1.0768,1.5149999999999999]
[null,null,null,null,null,null,null,null,null,null,null,78.2,0.66815000000000002,0.8135,0.64359999999999995,0.70069999999999999,0.69269999999999998,0.92689999999999995,0.66815000000000002,0.8135,1.0755999999999999,1.5138]
[null,null,null,null,null,null,null,null,null,null,null,78.3,0.66759999999999997,0.81284999999999996,0.64300000000000002,0.70009999999999994,0.69220000000000004,0.92630000000000001,0.66759999999999997,0.81284999999999996,1.0744,1.5125999999999999]
[null,null,null,null,null,null,null,null,null,null,null,78.400000000000006,0.66700000000000004,0.81220000000000003,0.64239999999999997,0.69940000000000002,0.69159999999999999,0.92559999999999998,0.66700000000000004,0.81220000000000003,1.0731999999999999,1.5116000000000001]
[null,null,null,null,null,null,null,null,null,null,null,78.5,0.66639999999999999,0.8115,0.64180000000000004,0.69879999999999998,0.69099999999999995,0.92490000000000006,0.66639999999999999,0.8115,1.0720000000000001,1.5107999999999999]
[null,null,null,null,null,null,null,null,null,null,null,78.599999999999994,0.66585000000000005,0.81084999999999996,0.64119999999999999,0.69810000000000005,0.6905,0.92420000000000002,0.66585000000000005,0.81084999999999996,1.0708,1.51]
[null,null,null,null,null,null,null,null,null,null,null,78.7,0.66520000000000001,0.81015000000000004,0.64049999999999996,0.69750000000000001,0.68989999999999996,0.92349999999999999,0.66520000000000001,0.81015000000000004,1.0695999999999999,1.5092000000000001]
[null,null,null,null,null,null,null,null,null,null,null,78.8,0.66460000000000008,0.80954999999999999,0.63990000000000002,0.69679999999999997,0.68930000000000002,0.92290000000000005,0.66460000000000008,0.80954999999999999,1.0684,1.5084]
[null,null,null,null,null,null,null,null,null,null,null,78.900000000000006,0.66710000000000003,0.80889999999999995,0.64539999999999997,0.69620000000000004,0.68879999999999997,0.92220000000000002,0.66710000000000003,0.80889999999999995,1.0671999999999999,1.5076000000000001]
[null,null,null,null,null,null,null,null,null,null,null,79,0.66349999999999998,0.80820000000000003,0.63880000000000003,0.60560000000000003,0.68820000000000003,0.92149999999999999,0.66349999999999998,0.80820000000000003,1.0660000000000001,1.5067999999999999]
[null,null,null,null,null,null,null,null,null,null,null,79.099999999999994,0.66290000000000004,0.80759999999999998,0.63819999999999999,0.69489999999999996,0.68759999999999999,0.92090000000000005,0.66290000000000004,0.80759999999999998,1.0648,1.506]
[null,null,null,null,null,null,null,null,null,null,null,79.2,0.66234999999999999,0.80689999999999995,0.63759999999999994,0.69430000000000003,0.68710000000000004,0.92020000000000002,0.66234999999999999,0.80689999999999995,1.0635999999999999,1.5047999999999999]
[null,null,null,null,null,null,null,null,null,null,null,79.3,0.66175000000000006,0.80625000000000002,0.63700000000000001,0.69359999999999999,0.6865,0.91949999999999998,0.66175000000000006,0.80625000000000002,1.0624,1.5035999999999998]
[null,null,null,null,null,null,null,null,null,null,null,79.400000000000006,0.66120000000000001,0.80559999999999998,0.63639999999999997,0.69299999999999995,0.68600000000000005,0.91890000000000005,0.66120000000000001,0.80559999999999998,1.0611999999999999,1.5025999999999999]
[null,null,null,null,null,null,null,null,null,null,null,79.5,0.66060000000000008,0.80495000000000005,0.63580000000000003,0.69230000000000003,0.68540000000000001,0.91820000000000002,0.66060000000000008,0.80495000000000005,1.06,1.5017999999999998]
[null,null,null,null,null,null,null,null,null,null,null,79.599999999999994,0.66005000000000003,0.80435000000000001,0.63519999999999999,0.69169999999999998,0.68489999999999995,0.91759999999999997,0.66005000000000003,0.80435000000000001,1.0588,1.5009999999999999]
[null,null,null,null,null,null,null,null,null,null,null,79.7,0.65949999999999998,0.80364999999999998,0.63470000000000004,0.69110000000000005,0.68430000000000002,0.91690000000000005,0.65949999999999998,0.80364999999999998,1.0575999999999999,1.5002]
[null,null,null,null,null,null,null,null,null,null,null,79.8,0.65894999999999992,0.80305000000000004,0.6341,0.69040000000000001,0.68379999999999996,0.9163,0.65894999999999992,0.80305000000000004,1.0564,1.4994000000000001]
[null,null,null,null,null,null,null,null,null,null,null,79.900000000000006,0.6613,0.8024,0.63939999999999997,0.68979999999999997,0.68320000000000003,0.91559999999999997,0.6613,0.8024,1.0551999999999999,1.4986000000000002]
[null,null,null,null,null,null,null,null,null,null,null,80,0.65779999999999994,0.80174999999999996,0.63290000000000002,0.68920000000000003,0.68269999999999997,0.91500000000000004,0.65779999999999994,0.80174999999999996,1.054,1.4978]
[null,null,null,null,null,null,null,null,null,null,null,80.099999999999994,0.6573,0.80115000000000003,0.63239999999999996,0.6885,0.68220000000000003,0.91439999999999999,0.6573,0.80115000000000003,1.0528,1.4970000000000001]
[null,null,null,null,null,null,null,null,null,null,null,80.2,0.65670000000000006,0.80049999999999999,0.63180000000000003,0.68789999999999996,0.68159999999999998,0.91369999999999996,0.65670000000000006,0.80049999999999999,1.0515999999999999,1.4958]
[null,null,null,null,null,null,null,null,null,null,null,80.3,0.65615000000000001,0.79984999999999995,0.63119999999999998,0.68730000000000002,0.68110000000000004,0.91310000000000002,0.65615000000000001,0.79984999999999995,1.0504,1.4945999999999999]
[null,null,null,null,null,null,null,null,null,null,null,80.400000000000006,0.65565000000000007,0.79925000000000002,0.63070000000000004,0.68659999999999999,0.68059999999999998,0.91249999999999998,0.65565000000000007,0.79925000000000002,1.0491999999999999,1.4936]
[null,null,null,null,null,null,null,null,null,null,null,80.5,0.65505000000000002,0.79864999999999997,0.63009999999999999,0.68600000000000005,0.68,0.91190000000000004,0.65505000000000002,0.79864999999999997,1.048,1.4927999999999999]
[null,null,null,null,null,null,null,null,null,null,null,80.599999999999994,0.65449999999999997,0.79800000000000004,0.62949999999999995,0.68540000000000001,0.67949999999999999,0.91120000000000001,0.65449999999999997,0.79800000000000004,1.0472000000000001,1.492]
[null,null,null,null,null,null,null,null,null,null,null,80.7,0.65400000000000003,0.79735,0.629,0.68479999999999996,0.67900000000000005,0.91059999999999997,0.65400000000000003,0.79735,1.0464,1.4912000000000001]
[null,null,null,null,null,null,null,null,null,null,null,80.8,0.65344999999999998,0.79674999999999996,0.62839999999999996,0.68410000000000004,0.67849999999999999,0.91,0.65344999999999998,0.79674999999999996,1.0456000000000001,1.4903999999999999]
[null,null,null,null,null,null,null,null,null,null,null,80.900000000000006,0.65569999999999995,0.79615000000000002,0.63349999999999995,0.6835,0.67789999999999995,0.90939999999999999,0.65569999999999995,0.79615000000000002,1.0448,1.4896]
[null,null,null,null,null,null,null,null,null,null,null,81,0.65234999999999999,0.79554999999999998,0.62729999999999997,0.68289999999999995,0.6774,0.90880000000000005,0.65234999999999999,0.79554999999999998,1.044,1.4887999999999999]
[null,null,null,null,null,null,null,null,null,null,null,81.099999999999994,0.65185000000000004,0.79495000000000005,0.62680000000000002,0.68230000000000002,0.67689999999999995,0.90820000000000001,0.65185000000000004,0.79495000000000005,1.0427999999999999,1.488]
[null,null,null,null,null,null,null,null,null,null,null,81.2,0.65129999999999999,0.79430000000000001,0.62619999999999998,0.68169999999999997,0.6764,0.90759999999999996,0.65129999999999999,0.79430000000000001,1.0415999999999999,1.4868000000000001]
[null,null,null,null,null,null,null,null,null,null,null,81.3,0.65080000000000005,0.79369999999999996,0.62570000000000003,0.68100000000000005,0.67589999999999995,0.90700000000000003,0.65080000000000005,0.79369999999999996,1.0406,1.4856]
[null,null,null,null,null,null,null,null,null,null,null,81.400000000000006,0.65024999999999999,0.79310000000000003,0.62509999999999999,0.6804,0.6754,0.90639999999999998,0.65024999999999999,0.79310000000000003,1.0397999999999998,1.4846000000000001]
[null,null,null,null,null,null,null,null,null,null,null,81.5,0.64975000000000005,0.79249999999999998,0.62460000000000004,0.67979999999999996,0.67490000000000006,0.90580000000000005,0.64975000000000005,0.79249999999999998,1.0389999999999999,1.4838]
[null,null,null,null,null,null,null,null,null,null,null,81.599999999999994,0.64924999999999999,0.79190000000000005,0.62409999999999999,0.67920000000000003,0.6744,0.9052,0.64924999999999999,0.79190000000000005,1.0378000000000001,1.4830000000000001]
[null,null,null,null,null,null,null,null,null,null,null,81.7,0.64870000000000005,0.7913,0.62350000000000005,0.67859999999999998,0.67390000000000005,0.90459999999999996,0.64870000000000005,0.7913,1.0366,1.4822000000000002]
[null,null,null,null,null,null,null,null,null,null,null,81.8,0.6482,0.79069999999999996,0.623,0.67800000000000005,0.6734,0.90400000000000003,0.6482,0.79069999999999996,1.0356000000000001,1.4814000000000001]
[null,null,null,null,null,null,null,null,null,null,null,81.900000000000006,0.65040000000000009,0.79005000000000003,0.62790000000000001,0.6774,0.67290000000000005,0.90339999999999998,0.65040000000000009,0.79005000000000003,1.0347999999999999,1.4806000000000001]
[null,null,null,null,null,null,null,null,null,null,null,82,0.64715,0.78944999999999999,0.62190000000000001,16767,0.6724,0.90280000000000005,0.64715,0.78944999999999999,1.034,1.4798]
[null,null,null,null,null,null,null,null,null,null,null,82.1,0.64664999999999995,0.78890000000000005,0.62139999999999995,0.67610000000000003,0.67190000000000005,0.90229999999999999,0.64664999999999995,0.78890000000000005,1.0327999999999999,1.4790000000000001]
[null,null,null,null,null,null,null,null,null,null,null,82.2,0.64615,0.7883,0.62090000000000001,0.67549999999999999,0.6714,0.90169999999999995,0.64615,0.7883,1.0315999999999999,1.4782000000000002]
[null,null,null,null,null,null,null,null,null,null,null,82.3,0.64559999999999995,0.78769999999999996,0.62029999999999996,0.67490000000000006,0.67090000000000005,0.90110000000000001,0.64559999999999995,0.78769999999999996,1.0306,1.4774]
[null,null,null,null,null,null,null,null,null,null,null,82.4,0.64510000000000001,0.78710000000000002,0.61980000000000002,0.67430000000000001,0.6704,0.90049999999999997,0.64510000000000001,0.78710000000000002,1.0297999999999998,1.4766000000000001]
[null,null,null,null,null,null,null,null,null,null,null,82.5,0.64460000000000006,0.78654999999999997,0.61929999999999996,0.67369999999999997,0.66990000000000005,0.9,0.64460000000000006,0.78654999999999997,1.0289999999999999,1.4758]
[null,null,null,null,null,null,null,null,null,null,null,82.6,0.64410000000000001,0.78595000000000004,0.61880000000000002,0.67310000000000003,0.6694,0.89939999999999998,0.64410000000000001,0.78595000000000004,1.0278,1.4750000000000001]
[null,null,null,null,null,null,null,null,null,null,null,82.7,0.64359999999999995,0.78534999999999999,0.61829999999999996,0.67249999999999999,0.66890000000000005,0.89880000000000004,0.64359999999999995,0.78534999999999999,1.0266,1.4742000000000002]
[null,null,null,null,null,null,null,null,null,null,null,82.8,0.6431,0.78480000000000005,0.61770000000000003,0.67190000000000005,0.66849999999999998,0.89829999999999999,0.6431,0.78480000000000005,1.0256000000000001,1.4734]
[null,null,null,null,null,null,null,null,null,null,null,82.9,0.6452,0.78420000000000001,0.62239999999999995,0.67130000000000001,0.66800000000000004,0.89770000000000005,0.6452,0.78420000000000001,1.0247999999999999,1.4726000000000001]
[null,null,null,null,null,null,null,null,null,null,null,83,0.6421,0.78364999999999996,0.61670000000000003,0.67069999999999996,0.66749999999999998,0.8972,0.6421,0.78364999999999996,1.024,1.4718]
[null,null,null,null,null,null,null,null,null,null,null,83.1,0.64159999999999995,0.78305000000000002,0.61619999999999997,0.67010000000000003,0.66700000000000004,0.89659999999999995,0.64159999999999995,0.78305000000000002,1.0232000000000001,1.4710000000000001]
[null,null,null,null,null,null,null,null,null,null,null,83.2,0.64115,0.78249999999999997,0.61570000000000003,0.66949999999999998,0.66659999999999997,0.89610000000000001,0.64115,0.78249999999999997,1.0224,1.4702000000000002]
[null,null,null,null,null,null,null,null,null,null,null,83.3,0.64064999999999994,0.78190000000000004,0.61519999999999997,0.66890000000000005,0.66610000000000003,0.89549999999999996,0.64064999999999994,0.78190000000000004,1.0214000000000001,1.4694]
[null,null,null,null,null,null,null,null,null,null,null,83.4,0.64015,0.78134999999999999,0.61470000000000002,0.66830000000000001,0.66559999999999997,0.89500000000000002,0.64015,0.78134999999999999,1.0202,1.4684000000000001]
[null,null,null,null,null,null,null,null,null,null,null,83.5,0.63965000000000005,0.78075000000000006,0.61419999999999997,0.66769999999999996,0.66510000000000002,0.89439999999999997,0.63965000000000005,0.78075000000000006,1.0189999999999999,1.4672000000000001]
[null,null,null,null,null,null,null,null,null,null,null,83.6,0.63919999999999999,0.7802,0.61370000000000002,0.66710000000000003,0.66469999999999996,0.89390000000000003,0.63919999999999999,0.7802,1.0182,1.466]
[null,null,null,null,null,null,null,null,null,null,null,83.7,0.63870000000000005,0.77959999999999996,0.61319999999999997,0.66649999999999998,0.66420000000000001,0.89329999999999998,0.63870000000000005,0.77959999999999996,1.0173999999999999,1.4652000000000001]
[null,null,null,null,null,null,null,null,null,null,null,83.8,0.63819999999999999,0.77905000000000002,0.61270000000000002,0.66590000000000005,0.66369999999999996,0.89280000000000004,0.63819999999999999,0.77905000000000002,1.0165999999999999,1.4643999999999999]
[null,null,null,null,null,null,null,null,null,null,null,83.9,0.64024999999999999,0.77854999999999996,0.61719999999999997,0.6653,0.6633,0.89229999999999998,0.64024999999999999,0.77854999999999996,1.0157999999999998,1.4636]
[null,null,null,null,null,null,null,null,null,null,null,84,0.63724999999999998,0.77795000000000003,0.61170000000000002,0.66479999999999995,0.66279999999999994,0.89170000000000005,0.63724999999999998,0.77795000000000003,1.0149999999999999,1.4627999999999999]
[null,null,null,null,null,null,null,null,null,null,null,84.1,0.63680000000000003,0.77739999999999998,0.61119999999999997,0.66420000000000001,0.66239999999999999,0.89119999999999999,0.63680000000000003,0.77739999999999998,1.0142,1.462]
[null,null,null,null,null,null,null,null,null,null,null,84.2,0.63630000000000009,0.77685000000000004,0.61070000000000002,0.66359999999999997,0.66190000000000004,0.89070000000000005,0.63630000000000009,0.77685000000000004,1.0133999999999999,1.4612000000000001]
[null,null,null,null,null,null,null,null,null,null,null,84.3,0.63585000000000003,0.77629999999999999,0.61019999999999996,0.66300000000000003,0.66149999999999998,0.89019999999999999,0.63585000000000003,0.77629999999999999,1.0125999999999999,1.4603999999999999]
[null,null,null,null,null,null,null,null,null,null,null,84.4,0.63539999999999996,0.77569999999999995,0.60980000000000001,0.66239999999999999,0.66100000000000003,0.88959999999999995,0.63539999999999996,0.77569999999999995,1.0117999999999998,1.4594]
[null,null,null,null,null,null,null,null,null,null,null,84.5,0.6349499999999999,0.77515000000000001,0.60929999999999995,0.66180000000000005,0.66059999999999997,0.8891,0.6349499999999999,0.77515000000000001,1.0109999999999999,1.4581999999999999]
[null,null,null,null,null,null,null,null,null,null,null,84.6,0.63444999999999996,0.77464999999999995,0.60880000000000001,0.66120000000000001,0.66010000000000002,0.88859999999999995,0.63444999999999996,0.77464999999999995,1.0098,1.4570000000000001]
[null,null,null,null,null,null,null,null,null,null,null,84.7,0.6339999999999999,0.77410000000000001,0.60829999999999995,0.66069999999999995,0.65969999999999995,0.8881,0.6339999999999999,0.77410000000000001,1.0085999999999999,1.4562000000000002]
[null,null,null,null,null,null,null,null,null,null,null,84.8,0.63349999999999995,0.77354999999999996,0.60780000000000001,0.66010000000000002,0.65920000000000001,0.88759999999999994,0.63349999999999995,0.77354999999999996,1.0076000000000001,1.4554]
[null,null,null,null,null,null,null,null,null,null,null,84.9,0.63549999999999995,0.77300000000000002,0.61219999999999997,0.65949999999999998,0.65880000000000005,0.8871,0.63549999999999995,0.77300000000000002,1.0067999999999999,1.4546000000000001]
[null,null,null,null,null,null,null,null,null,null,null,85,0.63260000000000005,0.77244999999999997,0.6069,0.65890000000000004,0.6583,0.88660000000000005,0.63260000000000005,0.77244999999999997,1.006,1.4538]
[null,null,null,null,null,null,null,null,null,null,null,85.1,0.63214999999999999,0.77195000000000003,0.60640000000000005,0.6583,0.65790000000000004,0.8861,0.63214999999999999,0.77195000000000003,1.0052000000000001,1.4530000000000001]
[null,null,null,null,null,null,null,null,null,null,null,85.2,0.63169999999999993,0.77139999999999997,0.60589999999999999,0.65780000000000005,0.65749999999999997,0.88560000000000005,0.63169999999999993,0.77139999999999997,1.0044,1.4522000000000002]
[null,null,null,null,null,null,null,null,null,null,null,85.3,0.63124999999999998,0.77085000000000004,0.60550000000000004,0.65720000000000001,0.65700000000000003,0.8851,0.63124999999999998,0.77085000000000004,1.0036,1.4514]
[null,null,null,null,null,null,null,null,null,null,null,85.4,0.63080000000000003,0.77029999999999998,0.60499999999999998,0.65659999999999996,0.65659999999999996,0.88460000000000005,0.63080000000000003,0.77029999999999998,1.0027999999999999,1.4506000000000001]
[null,null,null,null,null,null,null,null,null,null,null,85.5,0.63034999999999997,0.76980000000000004,0.60450000000000004,0.65600000000000003,0.65620000000000001,0.8841,0.63034999999999997,0.76980000000000004,1.002,1.4498]
[null,null,null,null,null,null,null,null,null,null,null,85.6,0.6298999999999999,0.76924999999999999,0.60409999999999997,0.65549999999999997,0.65569999999999995,0.88360000000000005,0.6298999999999999,0.76924999999999999,1.0012000000000001,1.4490000000000001]
[null,null,null,null,null,null,null,null,null,null,null,85.7,0.62945000000000007,0.76870000000000005,0.60360000000000003,0.65490000000000004,0.65529999999999999,0.8831,0.62945000000000007,0.76870000000000005,1.0004,1.4482000000000002]
[null,null,null,null,null,null,null,null,null,null,null,85.8,0.629,0.76819999999999999,0.60309999999999997,0.65429999999999999,0.65490000000000004,0.88260000000000005,0.629,0.76819999999999999,0.99960000000000004,1.4474]
[null,null,null,null,null,null,null,null,null,null,null,85.9,0.63095000000000001,0.76765000000000005,0.60740000000000005,0.65380000000000005,0.65449999999999997,0.8821,0.63095000000000001,0.76765000000000005,0.99880000000000002,1.4466000000000001]
[null,null,null,null,null,null,null,null,null,null,null,86,0.62809999999999999,0.7671,0.60219999999999996,0.6532,0.65400000000000003,0.88160000000000005,0.62809999999999999,0.7671,0.998,1.4458]
[null,null,null,null,null,null,null,null,null,null,null,86.1,0.62769999999999992,0.76659999999999995,0.6018,0.65259999999999996,0.65359999999999996,0.88109999999999999,0.62769999999999992,0.76659999999999995,0.99719999999999998,1.4450000000000001]
[null,null,null,null,null,null,null,null,null,null,null,86.2,0.62724999999999997,0.7661,0.60129999999999995,0.65210000000000001,0.6532,0.88070000000000004,0.62724999999999997,0.7661,0.99639999999999995,1.4442000000000002]
[null,null,null,null,null,null,null,null,null,null,null,86.3,0.62685000000000002,0.76554999999999995,0.60089999999999999,0.65149999999999997,0.65280000000000005,0.88019999999999998,0.62685000000000002,0.76554999999999995,0.99560000000000004,1.4434]
[null,null,null,null,null,null,null,null,null,null,null,86.4,0.62634999999999996,0.76505000000000001,0.60040000000000004,0.65090000000000003,0.65229999999999999,0.87970000000000004,0.62634999999999996,0.76505000000000001,0.99480000000000002,1.4428000000000001]
[null,null,null,null,null,null,null,null,null,null,null,86.5,0.62595000000000001,0.76449999999999996,0.6,0.65039999999999998,0.65190000000000003,0.87919999999999998,0.62595000000000001,0.76449999999999996,0.99399999999999999,1.4423999999999999]
[null,null,null,null,null,null,null,null,null,null,null,86.6,0.62549999999999994,0.76400000000000001,0.59950000000000003,0.64980000000000004,0.65149999999999997,0.87880000000000003,0.62549999999999994,0.76400000000000001,0.99319999999999997,1.4419999999999999]
[null,null,null,null,null,null,null,null,null,null,null,86.7,0.62509999999999999,0.76349999999999996,0.59909999999999997,0.6492,0.65110000000000001,0.87829999999999997,0.62509999999999999,0.76349999999999996,0.99239999999999995,1.4412]
[null,null,null,null,null,null,null,null,null,null,null,86.8,0.62464999999999993,0.76295000000000002,0.59860000000000002,0.64870000000000005,0.65069999999999995,0.87780000000000002,0.62464999999999993,0.76295000000000002,0.99160000000000004,1.4403999999999999]
[null,null,null,null,null,null,null,null,null,null,null,86.9,0.62650000000000006,0.76249999999999996,0.60270000000000001,0.64810000000000001,0.65029999999999999,0.87739999999999996,0.62650000000000006,0.76249999999999996,0.99080000000000001,1.4398]
[null,null,null,null,null,null,null,null,null,null,null,87,0.62385000000000002,0.76195000000000002,0.5978,0.64759999999999995,0.64990000000000003,0.87690000000000001,0.62385000000000002,0.76195000000000002,0.99,1.4394]
[null,null,null,null,null,null,null,null,null,null,null,87.1,0.62339999999999995,0.76144999999999996,0.59730000000000005,0.64700000000000002,0.64949999999999997,0.87649999999999995,0.62339999999999995,0.76144999999999996,0.98919999999999997,1.4390000000000001]
[null,null,null,null,null,null,null,null,null,null,null,87.2,0.623,0.76095000000000002,0.59689999999999999,0.64639999999999997,0.64910000000000001,0.876,0.623,0.76095000000000002,0.98839999999999995,1.4382000000000001]
[null,null,null,null,null,null,null,null,null,null,null,87.3,0.62260000000000004,0.76039999999999996,0.59650000000000003,0.64590000000000003,0.64870000000000005,0.87549999999999994,0.62260000000000004,0.76039999999999996,0.98780000000000001,1.4374]
[null,null,null,null,null,null,null,null,null,null,null,87.4,0.62214999999999998,0.75995000000000001,0.59599999999999997,0.64529999999999998,0.64829999999999999,0.87509999999999999,0.62214999999999998,0.75995000000000001,0.98739999999999994,1.4368000000000001]
[null,null,null,null,null,null,null,null,null,null,null,87.5,0.62175000000000002,0.75939999999999996,0.59560000000000002,0.64480000000000004,0.64790000000000003,0.87460000000000004,0.62175000000000002,0.75939999999999996,0.98699999999999999,1.4363999999999999]
[null,null,null,null,null,null,null,null,null,null,null,87.6,0.62134999999999996,0.75895000000000001,0.59519999999999995,0.64419999999999999,0.64749999999999996,0.87419999999999998,0.62134999999999996,0.75895000000000001,0.98619999999999997,1.4359999999999999]
[null,null,null,null,null,null,null,null,null,null,null,87.7,0.62090000000000001,0.75839999999999996,0.59470000000000001,0.64370000000000005,0.64710000000000001,0.87370000000000003,0.62090000000000001,0.75839999999999996,0.98539999999999994,1.4352]
[null,null,null,null,null,null,null,null,null,null,null,87.8,0.62050000000000005,0.75795000000000001,0.59430000000000005,0.6431,0.64670000000000005,0.87329999999999997,0.62050000000000005,0.75795000000000001,0.98460000000000003,1.4343999999999999]
[null,null,null,null,null,null,null,null,null,null,null,87.9,0.62224999999999997,0.75744999999999996,0.59819999999999995,0.64259999999999995,0.64629999999999999,0.87290000000000001,0.62224999999999997,0.75744999999999996,0.98380000000000001,1.4338]
[null,null,null,null,null,null,null,null,null,null,null,88,0.61970000000000003,0.75695000000000001,0.59350000000000003,0.64200000000000002,0.64590000000000003,0.87239999999999995,0.61970000000000003,0.75695000000000001,0.98299999999999998,1.4334]
[null,null,null,null,null,null,null,null,null,null,null,88.1,0.61924999999999997,0.75644999999999996,0.59299999999999997,0.64149999999999996,0.64549999999999996,0.872,0.61924999999999997,0.75644999999999996,0.98219999999999996,1.4330000000000001]
[null,null,null,null,null,null,null,null,null,null,null,88.2,0.61885000000000001,0.75600000000000001,0.59260000000000002,0.64090000000000003,0.64510000000000001,0.87160000000000004,0.61885000000000001,0.75600000000000001,0.98139999999999994,1.4322000000000001]
[null,null,null,null,null,null,null,null,null,null,null,88.3,0.61844999999999994,0.75544999999999995,0.59219999999999995,0.64039999999999997,0.64470000000000005,0.87109999999999999,0.61844999999999994,0.75544999999999995,0.98060000000000003,1.4314]
[null,null,null,null,null,null,null,null,null,null,null,88.4,0.61809999999999998,0.755,0.59179999999999999,0.63980000000000004,0.64439999999999997,0.87070000000000003,0.61809999999999998,0.755,0.9798,1.4306000000000001]
[null,null,null,null,null,null,null,null,null,null,null,88.5,0.61770000000000003,0.75449999999999995,0.59140000000000004,0.63929999999999998,0.64400000000000002,0.87029999999999996,0.61770000000000003,0.75449999999999995,0.97899999999999998,1.4298]
[null,null,null,null,null,null,null,null,null,null,null,88.6,0.61729999999999996,0.754,0.59099999999999997,0.63870000000000005,0.64359999999999995,0.86980000000000002,0.61729999999999996,0.754,0.97860000000000003,1.429]
[null,null,null,null,null,null,null,null,null,null,null,88.7,0.61685000000000001,0.75349999999999995,0.59050000000000002,0.63819999999999999,0.64319999999999999,0.86939999999999995,0.61685000000000001,0.75349999999999995,0.97819999999999996,1.4286000000000001]
[null,null,null,null,null,null,null,null,null,null,null,88.8,0.61644999999999994,0.75305,0.59009999999999996,0.63759999999999994,0.64280000000000004,0.86899999999999999,0.61644999999999994,0.75305,0.97760000000000002,1.4281999999999999]
[null,null,null,null,null,null,null,null,null,null,null,88.9,0.61814999999999998,0.75260000000000005,0.59389999999999998,0.6371,0.64239999999999997,0.86860000000000004,0.61814999999999998,0.75260000000000005,0.9768,1.4278]
[null,null,null,null,null,null,null,null,null,null,null,89,0.61570000000000003,0.75205,0.58930000000000005,0.63660000000000005,0.6421,0.86809999999999998,0.61570000000000003,0.75205,0.97599999999999998,1.4274]
[null,null,null,null,null,null,null,null,null,null,null,89.1,0.61529999999999996,0.75160000000000005,0.58889999999999998,0.63600000000000001,0.64170000000000005,0.86770000000000003,0.61529999999999996,0.75160000000000005,0.97519999999999996,1.427]
[null,null,null,null,null,null,null,null,null,null,null,89.2,0.6149,0.75114999999999998,0.58850000000000002,0.63549999999999995,0.64129999999999998,0.86729999999999996,0.6149,0.75114999999999998,0.97439999999999993,1.4262000000000001]
[null,null,null,null,null,null,null,null,null,null,null,89.3,0.61454999999999993,0.75065000000000004,0.58809999999999996,0.63500000000000001,0.64100000000000001,0.8669,0.61454999999999993,0.75065000000000004,0.97360000000000002,1.4254]
[null,null,null,null,null,null,null,null,null,null,null,89.4,0.61414999999999997,0.75019999999999998,0.5877,0.63439999999999996,0.64059999999999995,0.86650000000000005,0.61414999999999997,0.75019999999999998,0.9728,1.4248000000000001]
[null,null,null,null,null,null,null,null,null,null,null,89.5,0.61375000000000002,0.74970000000000003,0.58730000000000004,0.63390000000000002,0.64019999999999999,0.86609999999999998,0.61375000000000002,0.74970000000000003,0.97199999999999998,1.4243999999999999]
[null,null,null,null,null,null,null,null,null,null,null,89.6,0.61335000000000006,0.74924999999999997,0.58689999999999998,0.63329999999999997,0.63980000000000004,0.86570000000000003,0.61335000000000006,0.74924999999999997,0.97119999999999995,1.4239999999999999]
[null,null,null,null,null,null,null,null,null,null,null,89.7,0.61299999999999999,0.74870000000000003,0.58650000000000002,0.63280000000000003,0.63949999999999996,0.86529999999999996,0.61299999999999999,0.74870000000000003,0.97039999999999993,1.4232]
[null,null,null,null,null,null,null,null,null,null,null,89.8,0.61260000000000003,0.74829999999999997,0.58609999999999995,0.63229999999999997,0.6391,0.8649,0.61260000000000003,0.74829999999999997,0.9698,1.4223999999999999]
[null,null,null,null,null,null,null,null,null,null,null,89.9,0.61424999999999996,0.74785000000000001,0.5897,0.63170000000000004,0.63880000000000003,0.86450000000000005,0.61424999999999996,0.74785000000000001,0.96939999999999993,1.4216]
[null,null,null,null,null,null,null,null,null,null,null,90,0.61185,0.74755000000000005,0.58530000000000004,0.63119999999999998,0.63839999999999997,0.86409999999999998,0.61185,0.74755000000000005,0.96899999999999997,1.4207999999999998]
[null,null,null,null,null,null,null,null,null,null,null,90.1,0.61149999999999993,0.74719999999999998,0.58499999999999996,0.63100000000000001,0.63800000000000001,0.86370000000000002,0.61149999999999993,0.74719999999999998,0.96819999999999995,1.42]
[null,null,null,null,null,null,null,null,null,null,null,90.2,0.61115000000000008,0.74680000000000002,0.58460000000000001,0.63070000000000004,0.63770000000000004,0.86329999999999996,0.61115000000000008,0.74680000000000002,0.96739999999999993,1.4192]
[null,null,null,null,null,null,null,null,null,null,null,90.3,0.61075000000000002,0.74644999999999995,0.58420000000000005,0.63029999999999997,0.63729999999999998,0.8629,0.61075000000000002,0.74644999999999995,0.96660000000000001,1.4183999999999999]
[null,null,null,null,null,null,null,null,null,null,null,90.4,0.61040000000000005,0.74604999999999999,0.58379999999999999,0.63,0.63700000000000001,0.86250000000000004,0.61040000000000005,0.74604999999999999,0.96579999999999999,1.4177999999999999]
[null,null,null,null,null,null,null,null,null,null,null,90.5,0.61,0.74570000000000003,0.58340000000000003,0.62960000000000005,0.63660000000000005,0.86209999999999998,0.61,0.74570000000000003,0.96499999999999997,1.4174]
[null,null,null,null,null,null,null,null,null,null,null,90.6,0.60965000000000003,0.74534999999999996,0.58299999999999996,0.62929999999999997,0.63629999999999998,0.86170000000000002,0.60965000000000003,0.74534999999999996,0.96419999999999995,1.417]
[null,null,null,null,null,null,null,null,null,null,null,90.7,0.60929999999999995,0.74495,0.5827,0.629,0.63590000000000002,0.86129999999999995,0.60929999999999995,0.74495,0.96339999999999992,1.4162000000000001]
[null,null,null,null,null,null,null,null,null,null,null,90.8,0.6089500000000001,0.74460000000000004,0.58230000000000004,0.62860000000000005,0.63560000000000005,0.8609,0.6089500000000001,0.74460000000000004,0.96260000000000001,1.4154]
[null,null,null,null,null,null,null,null,null,null,null,90.9,0.61044999999999994,0.74429999999999996,0.5857,0.62829999999999997,0.63519999999999999,0.86060000000000003,0.61044999999999994,0.74429999999999996,0.96179999999999999,1.4148000000000001]
[null,null,null,null,null,null,null,null,null,null,null,91,0.60820000000000007,0.74390000000000001,0.58150000000000002,0.628,0.63490000000000002,0.86019999999999996,0.60820000000000007,0.74390000000000001,0.96099999999999997,1.4143999999999999]
[null,null,null,null,null,null,null,null,null,null,null,91.1,0.60785,0.74355000000000004,0.58120000000000005,0.62760000000000005,0.63449999999999995,0.85980000000000001,0.60785,0.74355000000000004,0.96060000000000001,1.4139999999999999]
[null,null,null,null,null,null,null,null,null,null,null,91.2,0.60750000000000004,0.74314999999999998,0.58079999999999998,0.62729999999999997,0.63419999999999999,0.85940000000000005,0.60750000000000004,0.74314999999999998,0.96019999999999994,1.4132]
[null,null,null,null,null,null,null,null,null,null,null,91.3,0.60709999999999997,0.74280000000000002,0.58040000000000003,0.62690000000000001,0.63380000000000003,0.85899999999999999,0.60709999999999997,0.74280000000000002,0.95960000000000001,1.4123999999999999]
[null,null,null,null,null,null,null,null,null,null,null,91.4,0.60680000000000001,0.74250000000000005,0.58009999999999995,0.62660000000000005,0.63349999999999995,0.85870000000000002,0.60680000000000001,0.74250000000000005,0.95879999999999999,1.4117999999999999]
[null,null,null,null,null,null,null,null,null,null,null,91.5,0.60640000000000005,0.74209999999999998,0.57969999999999999,0.62629999999999997,0.6331,0.85829999999999995,0.60640000000000005,0.74209999999999998,0.95799999999999996,1.4114]
[null,null,null,null,null,null,null,null,null,null,null,91.6,0.60604999999999998,0.74175000000000002,0.57930000000000004,0.62590000000000001,0.63280000000000003,0.8579,0.60604999999999998,0.74175000000000002,0.95719999999999994,1.411]
[null,null,null,null,null,null,null,null,null,null,null,91.7,0.60575000000000001,0.74145000000000005,0.57899999999999996,0.62560000000000004,0.63249999999999995,0.85760000000000003,0.60575000000000001,0.74145000000000005,0.95639999999999992,1.4102000000000001]
[null,null,null,null,null,null,null,null,null,null,null,91.8,0.60535000000000005,0.74104999999999999,0.5786,0.62529999999999997,0.6321,0.85719999999999996,0.60535000000000005,0.74104999999999999,0.9556,1.4094]
[null,null,null,null,null,null,null,null,null,null,null,91.9,0.60685,0.74070000000000003,0.58189999999999997,0.62490000000000001,0.63180000000000003,0.85680000000000001,0.60685,0.74070000000000003,0.95479999999999998,1.4088000000000001]
[null,null,null,null,null,null,null,null,null,null,null,92,0.60470000000000002,0.74039999999999995,0.57789999999999997,0.62460000000000004,0.63149999999999995,0.85650000000000004,0.60470000000000002,0.74039999999999995,0.95399999999999996,1.4083999999999999]
[null,null,null,null,null,null,null,null,null,null,null,92.1,0.60430000000000006,0.74,0.57750000000000001,0.62429999999999997,0.63109999999999999,0.85609999999999997,0.60430000000000006,0.74,0.95319999999999994,1.4079999999999999]
[null,null,null,null,null,null,null,null,null,null,null,92.2,0.60400000000000009,0.73970000000000002,0.57720000000000005,0.62390000000000001,0.63080000000000003,0.85580000000000001,0.60400000000000009,0.73970000000000002,0.95239999999999991,1.4076]
[null,null,null,null,null,null,null,null,null,null,null,92.3,0.60365000000000002,0.73934999999999995,0.57679999999999998,0.62360000000000004,0.63049999999999995,0.85540000000000005,0.60365000000000002,0.73934999999999995,0.95179999999999998,1.4072]
[null,null,null,null,null,null,null,null,null,null,null,92.4,0.60329999999999995,0.73895,0.57650000000000001,0.62329999999999997,0.63009999999999999,0.85499999999999998,0.60329999999999995,0.73895,0.95139999999999991,1.4066000000000001]
[null,null,null,null,null,null,null,null,null,null,null,92.5,0.60294999999999999,0.73865000000000003,0.57609999999999995,0.62290000000000001,0.62980000000000003,0.85470000000000002,0.60294999999999999,0.73865000000000003,0.95099999999999996,1.4057999999999999]
[null,null,null,null,null,null,null,null,null,null,null,92.6,0.60264999999999991,0.73829999999999996,0.57579999999999998,0.62260000000000004,0.62949999999999995,0.85429999999999995,0.60264999999999991,0.73829999999999996,0.9506,1.405]
[null,null,null,null,null,null,null,null,null,null,null,92.7,0.60230000000000006,0.73794999999999999,0.57540000000000002,0.62229999999999996,0.62919999999999998,0.85399999999999998,0.60230000000000006,0.73794999999999999,0.95019999999999993,1.4046000000000001]
[null,null,null,null,null,null,null,null,null,null,null,92.8,0.60194999999999999,0.73760000000000003,0.57509999999999994,0.62190000000000001,0.62880000000000003,0.85360000000000003,0.60194999999999999,0.73760000000000003,0.9496,1.4041999999999999]
[null,null,null,null,null,null,null,null,null,null,null,92.9,0.60335000000000005,0.73729999999999996,0.57820000000000005,0.62160000000000004,0.62849999999999995,0.85329999999999995,0.60335000000000005,0.73729999999999996,0.94879999999999998,1.4037999999999999]
[null,null,null,null,null,null,null,null,null,null,null,93,0.60129999999999995,0.73694999999999999,0.57440000000000002,0.62129999999999996,0.62819999999999998,0.85299999999999998,0.60129999999999995,0.73694999999999999,0.94799999999999995,1.4034]
[null,null,null,null,null,null,null,null,null,null,null,93.1,0.60094999999999998,0.73660000000000003,0.57399999999999995,0.62090000000000001,0.62790000000000001,0.85260000000000002,0.60094999999999998,0.73660000000000003,0.9476,1.403]
[null,null,null,null,null,null,null,null,null,null,null,93.2,0.60065000000000002,0.73629999999999995,0.57369999999999999,0.62060000000000004,0.62760000000000005,0.85229999999999995,0.60065000000000002,0.73629999999999995,0.94719999999999993,1.4022000000000001]
[null,null,null,null,null,null,null,null,null,null,null,93.3,0.60030000000000006,0.73594999999999999,0.57340000000000002,0.62029999999999996,0.62719999999999998,0.85189999999999999,0.60030000000000006,0.73594999999999999,0.9466,1.4014]
[null,null,null,null,null,null,null,null,null,null,null,93.4,0.59994999999999998,0.73560000000000003,0.57299999999999995,0.62,0.62690000000000001,0.85160000000000002,0.59994999999999998,0.73560000000000003,0.94579999999999997,1.4008]
[null,null,null,null,null,null,null,null,null,null,null,93.5,0.59965000000000002,0.73529999999999995,0.57269999999999999,0.61960000000000004,0.62660000000000005,0.85129999999999995,0.59965000000000002,0.73529999999999995,0.94499999999999995,1.4003999999999999]
[null,null,null,null,null,null,null,null,null,null,null,93.6,0.59929999999999994,0.73494999999999999,0.57230000000000003,0.61929999999999996,0.62629999999999997,0.85089999999999999,0.59929999999999994,0.73494999999999999,0.9446,1.4]
[null,null,null,null,null,null,null,null,null,null,null,93.7,0.59899999999999998,0.73460000000000003,0.57199999999999995,0.61899999999999999,0.626,0.85060000000000002,0.59899999999999998,0.73460000000000003,0.94419999999999993,1.3992]
[null,null,null,null,null,null,null,null,null,null,null,93.8,0.59870000000000001,0.73429999999999995,0.57169999999999999,0.61860000000000004,0.62570000000000003,0.85029999999999994,0.59870000000000001,0.73429999999999995,0.94359999999999999,1.3983999999999999]
[null,null,null,null,null,null,null,null,null,null,null,93.9,0.60004999999999997,0.73394999999999999,0.57469999999999999,0.61829999999999996,0.62539999999999996,0.84989999999999999,0.60004999999999997,0.73394999999999999,0.94279999999999997,1.3977999999999999]
[null,null,null,null,null,null,null,null,null,null,null,94,0.59799999999999998,0.73365000000000002,0.57099999999999995,0.61799999999999999,0.625,0.84960000000000002,0.59799999999999998,0.73365000000000002,0.94199999999999995,1.3974]
[null,null,null,null,null,null,null,null,null,null,null,94.1,0.59770000000000001,0.73329999999999995,0.57069999999999999,0.61770000000000003,0.62470000000000003,0.84930000000000005,0.59770000000000001,0.73329999999999995,0.94159999999999999,1.397]
[null,null,null,null,null,null,null,null,null,null,null,94.2,0.59739999999999993,0.73294999999999999,0.57040000000000002,0.61729999999999996,0.62439999999999996,0.84889999999999999,0.59739999999999993,0.73294999999999999,0.94119999999999993,1.3962000000000001]
[null,null,null,null,null,null,null,null,null,null,null,94.3,0.59709999999999996,0.73265000000000002,0.57010000000000005,0.61699999999999999,0.62409999999999999,0.84860000000000002,0.59709999999999996,0.73265000000000002,0.94059999999999999,1.3954]
[null,null,null,null,null,null,null,null,null,null,null,94.4,0.59675,0.73234999999999995,0.56969999999999998,0.61670000000000003,0.62380000000000002,0.84830000000000005,0.59675,0.73234999999999995,0.93979999999999997,1.3948]
[null,null,null,null,null,null,null,null,null,null,null,94.5,0.59645000000000004,0.73199999999999998,0.56940000000000002,0.61639999999999995,0.62350000000000005,0.84799999999999998,0.59645000000000004,0.73199999999999998,0.93899999999999995,1.3943999999999999]
[null,null,null,null,null,null,null,null,null,null,null,94.6,0.59614999999999996,0.73170000000000002,0.56910000000000005,0.61599999999999999,0.62319999999999998,0.84770000000000001,0.59614999999999996,0.73170000000000002,0.93859999999999999,1.3939999999999999]
[null,null,null,null,null,null,null,null,null,null,null,94.7,0.59584999999999999,0.73134999999999994,0.56879999999999997,0.61570000000000003,0.62290000000000001,0.84730000000000005,0.59584999999999999,0.73134999999999994,0.93819999999999992,1.3932]
[null,null,null,null,null,null,null,null,null,null,null,94.8,0.59555000000000002,0.73104999999999998,0.56850000000000001,0.61539999999999995,0.62260000000000004,0.84699999999999998,0.59555000000000002,0.73104999999999998,0.93779999999999997,1.3923999999999999]
[null,null,null,null,null,null,null,null,null,null,null,94.9,0.59684999999999999,0.73070000000000002,0.57140000000000002,0.61509999999999998,0.62229999999999996,0.84670000000000001,0.59684999999999999,0.73070000000000002,0.93740000000000001,1.3917999999999999]
[null,null,null,null,null,null,null,null,null,null,null,95,0.59489999999999998,0.73040000000000005,0.56779999999999997,0.61470000000000002,0.622,0.84640000000000004,0.59489999999999998,0.73040000000000005,0.93700000000000006,1.3914]
[null,null,null,null,null,null,null,null,null,null,null,95.1,0.59460000000000002,0.73009999999999997,0.5675,0.61439999999999995,0.62170000000000003,0.84609999999999996,0.59460000000000002,0.73009999999999997,0.93620000000000003,1.391]
[null,null,null,null,null,null,null,null,null,null,null,95.2,0.59430000000000005,0.7298,0.56720000000000004,0.61409999999999998,0.62139999999999995,0.8458,0.59430000000000005,0.7298,0.93540000000000001,1.3902000000000001]
[null,null,null,null,null,null,null,null,null,null,null,95.3,0.59399999999999997,0.72945000000000004,0.56689999999999996,0.61380000000000001,0.62109999999999999,0.84550000000000003,0.59399999999999997,0.72945000000000004,0.93480000000000008,1.3894]
[null,null,null,null,null,null,null,null,null,null,null,95.4,0.59375,0.72914999999999996,0.56659999999999999,0.61339999999999995,0.62090000000000001,0.84519999999999995,0.59375,0.72914999999999996,0.93440000000000001,1.3888]
[null,null,null,null,null,null,null,null,null,null,null,95.5,0.59345000000000003,0.72885,0.56630000000000003,0.61309999999999998,0.62060000000000004,0.84489999999999998,0.59345000000000003,0.72885,0.93400000000000005,1.3883999999999999]
[null,null,null,null,null,null,null,null,null,null,null,95.6,0.59314999999999996,0.72855000000000003,0.56599999999999995,0.61280000000000001,0.62029999999999996,0.84460000000000002,0.59314999999999996,0.72855000000000003,0.9336000000000001,1.3879999999999999]
[null,null,null,null,null,null,null,null,null,null,null,95.7,0.59284999999999999,0.72824999999999995,0.56569999999999998,0.61250000000000004,0.62,0.84430000000000005,0.59284999999999999,0.72824999999999995,0.93320000000000003,1.3872]
[null,null,null,null,null,null,null,null,null,null,null,95.8,0.59255000000000002,0.72789999999999999,0.56540000000000001,0.61219999999999997,0.61970000000000003,0.84399999999999997,0.59255000000000002,0.72789999999999999,0.93280000000000007,1.3863999999999999]
[null,null,null,null,null,null,null,null,null,null,null,95.9,0.59375,0.72760000000000002,0.56810000000000005,0.61180000000000001,0.61939999999999995,0.84370000000000001,0.59375,0.72760000000000002,0.93240000000000001,1.3857999999999999]
[null,null,null,null,null,null,null,null,null,null,null,96,0.59194999999999998,0.72729999999999995,0.56479999999999997,0.61150000000000004,0.61909999999999998,0.84340000000000004,0.59194999999999998,0.72729999999999995,0.93200000000000005,1.3854]
[null,null,null,null,null,null,null,null,null,null,null,96.1,0.59165000000000001,0.72699999999999998,0.5645,0.61119999999999997,0.61880000000000002,0.84309999999999996,0.59165000000000001,0.72699999999999998,0.93160000000000009,1.385]
[null,null,null,null,null,null,null,null,null,null,null,96.2,0.59140000000000004,0.72670000000000001,0.56420000000000003,0.6109,0.61860000000000004,0.84279999999999999,0.59140000000000004,0.72670000000000001,0.93120000000000003,1.3842000000000001]
[null,null,null,null,null,null,null,null,null,null,null,96.3,0.59109999999999996,0.72635000000000005,0.56389999999999996,0.61060000000000003,0.61829999999999996,0.84250000000000003,0.59109999999999996,0.72635000000000005,0.93060000000000009,1.3834]
[null,null,null,null,null,null,null,null,null,null,null,96.4,0.59079999999999999,0.72604999999999997,0.56359999999999999,0.61019999999999996,0.61799999999999999,0.84219999999999995,0.59079999999999999,0.72604999999999997,0.92980000000000007,1.3828]
[null,null,null,null,null,null,null,null,null,null,null,96.5,0.59050000000000002,0.72575000000000001,0.56330000000000002,0.6099,0.61770000000000003,0.84189999999999998,0.59050000000000002,0.72575000000000001,0.92900000000000005,1.3823999999999999]
[null,null,null,null,null,null,null,null,null,null,null,96.6,0.59019999999999995,0.72545000000000004,0.56299999999999994,0.60960000000000003,0.61739999999999995,0.84160000000000001,0.59019999999999995,0.72545000000000004,0.92860000000000009,1.3819999999999999]
[null,null,null,null,null,null,null,null,null,null,null,96.7,0.58994999999999997,0.72514999999999996,0.56269999999999998,0.60929999999999995,0.61719999999999997,0.84130000000000005,0.58994999999999997,0.72514999999999996,0.92820000000000003,1.3812]
[null,null,null,null,null,null,null,null,null,null,null,96.8,0.58965000000000001,0.72484999999999999,0.56240000000000001,0.60899999999999999,0.6169,0.84099999999999997,0.58965000000000001,0.72484999999999999,0.92780000000000007,1.3803999999999998]
[null,null,null,null,null,null,null,null,null,null,null,96.9,0.5908500000000001,0.72450000000000003,0.56510000000000005,0.60870000000000002,0.61660000000000004,0.8407,0.5908500000000001,0.72450000000000003,0.9274,1.3797999999999999]
[null,null,null,null,null,null,null,null,null,null,null,97,0.58909999999999996,0.72424999999999995,0.56189999999999996,0.60829999999999995,0.61629999999999996,0.84050000000000002,0.58909999999999996,0.72424999999999995,0.92700000000000005,1.3794]
[null,null,null,null,null,null,null,null,null,null,null,97.1,0.58884999999999998,0.72394999999999998,0.56159999999999999,0.60799999999999998,0.61609999999999998,0.84019999999999995,0.58884999999999998,0.72394999999999998,0.92660000000000009,1.379]
[null,null,null,null,null,null,null,null,null,null,null,97.2,0.58855000000000002,0.72365000000000002,0.56130000000000002,0.60770000000000002,0.61580000000000001,0.83989999999999998,0.58855000000000002,0.72365000000000002,0.92620000000000002,1.3782000000000001]
[null,null,null,null,null,null,null,null,null,null,null,97.3,0.58825000000000005,0.72335000000000005,0.56100000000000005,0.60740000000000005,0.61550000000000005,0.83960000000000001,0.58825000000000005,0.72335000000000005,0.92580000000000007,1.3774]
[null,null,null,null,null,null,null,null,null,null,null,97.4,0.58799999999999997,0.72304999999999997,0.56079999999999997,0.60709999999999997,0.61519999999999997,0.83930000000000005,0.58799999999999997,0.72304999999999997,0.9254,1.3768]
[null,null,null,null,null,null,null,null,null,null,null,97.5,0.58774999999999999,0.72275,0.5605,0.60680000000000001,0.61499999999999999,0.83909999999999996,0.58774999999999999,0.72275,0.92500000000000004,1.3763999999999998]
[null,null,null,null,null,null,null,null,null,null,null,97.6,0.58745000000000003,0.72245000000000004,0.56020000000000003,0.60640000000000005,0.61470000000000002,0.83879999999999999,0.58745000000000003,0.72245000000000004,0.92460000000000009,1.3759999999999999]
[null,null,null,null,null,null,null,null,null,null,null,97.7,0.58714999999999995,0.72214999999999996,0.55989999999999995,0.60609999999999997,0.61439999999999995,0.83850000000000002,0.58714999999999995,0.72214999999999996,0.92420000000000002,1.3755999999999999]
[null,null,null,null,null,null,null,null,null,null,null,97.8,0.58694999999999997,0.72184999999999999,0.55969999999999998,0.60580000000000001,0.61419999999999997,0.83819999999999995,0.58694999999999997,0.72184999999999999,0.92380000000000007,1.3752]
[null,null,null,null,null,null,null,null,null,null,null,97.9,0.58804999999999996,0.72160000000000002,0.56220000000000003,0.60550000000000004,0.6139,0.83799999999999997,0.58804999999999996,0.72160000000000002,0.9234,1.3746]
[null,null,null,null,null,null,null,null,null,null,null,98,0.58635000000000004,0.72130000000000005,0.55910000000000004,0.60519999999999996,0.61360000000000003,0.8377,0.58635000000000004,0.72130000000000005,0.92300000000000004,1.3737999999999999]
[null,null,null,null,null,null,null,null,null,null,null,98.1,0.58614999999999995,0.72099999999999997,0.55889999999999995,0.60489999999999999,0.61339999999999995,0.83740000000000003,0.58614999999999995,0.72099999999999997,0.92260000000000009,1.373]
[null,null,null,null,null,null,null,null,null,null,null,98.2,0.58584999999999998,0.72070000000000001,0.55859999999999999,0.60460000000000003,0.61309999999999998,0.83720000000000006,0.58584999999999998,0.72070000000000001,0.92220000000000002,1.373]
[null,null,null,null,null,null,null,null,null,null,null,98.3,0.58560000000000001,0.72040000000000004,0.55830000000000002,0.60419999999999996,0.6129,0.83689999999999998,0.58560000000000001,0.72040000000000004,0.92180000000000006,1.373]
[null,null,null,null,null,null,null,null,null,null,null,98.4,0.58535000000000004,0.72009999999999996,0.55810000000000004,0.60389999999999999,0.61260000000000003,0.83660000000000001,0.58535000000000004,0.72009999999999996,0.9214,1.3726]
[null,null,null,null,null,null,null,null,null,null,null,98.5,0.58504999999999996,0.71984999999999999,0.55779999999999996,0.60360000000000003,0.61229999999999996,0.83640000000000003,0.58504999999999996,0.71984999999999999,0.92100000000000004,1.3717999999999999]
[null,null,null,null,null,null,null,null,null,null,null,98.6,0.58479999999999999,0.71955000000000002,0.5575,0.60329999999999995,0.61209999999999998,0.83609999999999995,0.58479999999999999,0.71955000000000002,0.92060000000000008,1.371]
[null,null,null,null,null,null,null,null,null,null,null,98.7,0.58455000000000001,0.71930000000000005,0.55730000000000002,0.60299999999999998,0.61180000000000001,0.83589999999999998,0.58455000000000001,0.71930000000000005,0.92020000000000002,1.3706]
[null,null,null,null,null,null,null,null,null,null,null,98.8,0.58430000000000004,0.71899999999999997,0.55700000000000005,0.60270000000000001,0.61160000000000003,0.83560000000000001,0.58430000000000004,0.71899999999999997,0.91980000000000006,1.3702000000000001]
[null,null,null,null,null,null,null,null,null,null,null,98.9,0.58535000000000004,0.71870000000000001,0.55940000000000001,0.60240000000000005,0.61129999999999995,0.83530000000000004,0.58535000000000004,0.71870000000000001,0.9194,1.3696000000000002]
[null,null,null,null,null,null,null,null,null,null,null,99,0.58379999999999999,0.71845000000000003,0.55649999999999999,0.60209999999999997,0.61109999999999998,0.83509999999999995,0.58379999999999999,0.71845000000000003,0.91900000000000004,1.3688]
[null,null,null,null,null,null,null,null,null,null,null,99.1,0.58355000000000001,0.71809999999999996,0.55630000000000002,0.6018,0.61080000000000001,0.83479999999999999,0.58355000000000001,0.71809999999999996,0.91860000000000008,1.3680000000000001]
[null,null,null,null,null,null,null,null,null,null,null,99.2,0.58330000000000004,0.71784999999999999,0.55600000000000005,0.60140000000000005,0.61060000000000003,0.83460000000000001,0.58330000000000004,0.71784999999999999,0.91820000000000002,1.3672000000000002]
[null,null,null,null,null,null,null,null,null,null,null,99.3,0.58304999999999996,0.71755000000000002,0.55579999999999996,0.60109999999999997,0.61029999999999995,0.83430000000000004,0.58304999999999996,0.71755000000000002,0.91780000000000006,1.3664000000000001]
[null,null,null,null,null,null,null,null,null,null,null,99.4,0.58279999999999998,0.71730000000000005,0.55549999999999999,0.6008,0.61009999999999998,0.83409999999999995,0.58279999999999998,0.71730000000000005,0.91739999999999999,1.3658000000000001]
[null,null,null,null,null,null,null,null,null,null,null,99.5,0.58255000000000001,0.71699999999999997,0.55530000000000002,0.60050000000000003,0.60980000000000001,0.83379999999999999,0.58255000000000001,0.71699999999999997,0.91700000000000004,1.3653999999999999]
[null,null,null,null,null,null,null,null,null,null,null,99.6,0.58230000000000004,0.71675,0.55500000000000005,0.60019999999999996,0.60960000000000003,0.83360000000000001,0.58230000000000004,0.71675,0.91660000000000008,1.365]
[null,null,null,null,null,null,null,null,null,null,null,99.7,0.58204999999999996,0.71645000000000003,0.55479999999999996,0.59989999999999999,0.60929999999999995,0.83330000000000004,0.58204999999999996,0.71645000000000003,0.91620000000000001,1.3646]
[null,null,null,null,null,null,null,null,null,null,null,99.8,0.58179999999999998,0.71619999999999995,0.55449999999999999,0.59960000000000002,0.60909999999999997,0.83309999999999995,0.58179999999999998,0.71619999999999995,0.91580000000000006,1.3642000000000001]
[null,null,null,null,null,null,null,null,null,null,null,99.9,0.58279999999999998,0.71589999999999998,0.55679999999999996,0.59930000000000005,0.60880000000000001,0.83279999999999998,0.58279999999999998,0.71589999999999998,0.91539999999999999,1.3636000000000001]
[null,null,null,null,null,null,null,null,null,null,null,100,0.58130000000000004,0.71565000000000001,0.55400000000000005,0.59899999999999998,0.60860000000000003,0.83260000000000001,0.58130000000000004,0.71565000000000001,0.91500000000000004,1.3628]
[null,null,null,null,null,null,null,null,null,null,null,100.1,0.58104999999999996,0.71535000000000004,0.55379999999999996,0.59870000000000001,0.60829999999999995,0.83230000000000004,0.58104999999999996,0.71535000000000004,0.91460000000000008,1.3620000000000001]
[null,null,null,null,null,null,null,null,null,null,null,100.2,0.58084999999999998,0.71509999999999996,0.55359999999999998,0.59840000000000004,0.60809999999999997,0.83209999999999995,0.58084999999999998,0.71509999999999996,0.91420000000000001,1.3616000000000001]
[null,null,null,null,null,null,null,null,null,null,null,100.3,0.5806,0.71479999999999999,0.55330000000000001,0.59809999999999997,0.6079,0.83189999999999997,0.5806,0.71479999999999999,0.91380000000000006,1.3612]
[null,null,null,null,null,null,null,null,null,null,null,100.4,0.58035000000000003,0.71450000000000002,0.55310000000000004,0.59770000000000001,0.60760000000000003,0.83160000000000001,0.58035000000000003,0.71450000000000002,0.91339999999999999,1.3608]
[null,null,null,null,null,null,null,null,null,null,null,100.5,0.58014999999999994,0.71425000000000005,0.55289999999999995,0.59740000000000004,0.60740000000000005,0.83140000000000003,0.58014999999999994,0.71425000000000005,0.91300000000000003,1.3604000000000001]
[null,null,null,null,null,null,null,null,null,null,null,100.6,0.57984999999999998,0.71394999999999997,0.55259999999999998,0.59709999999999996,0.60709999999999997,0.83109999999999995,0.57984999999999998,0.71394999999999997,0.91260000000000008,1.36]
[null,null,null,null,null,null,null,null,null,null,null,100.7,0.57965,0.7137,0.5524,0.5968,0.6069,0.83089999999999997,0.57965,0.7137,0.91220000000000001,1.3596000000000001]
[null,null,null,null,null,null,null,null,null,null,null,100.8,0.57945000000000002,0.71345000000000003,0.55220000000000002,0.59650000000000003,0.60670000000000002,0.83069999999999999,0.57945000000000002,0.71345000000000003,0.91180000000000005,1.3592]
[null,null,null,null,null,null,null,null,null,null,null,100.9,0.58035000000000003,0.71314999999999995,0.55430000000000001,0.59619999999999995,0.60640000000000005,0.83040000000000003,0.58035000000000003,0.71314999999999995,0.91139999999999999,1.359]
[null,null,null,null,null,null,null,null,null,null,null,101,0.57894999999999996,0.71289999999999998,0.55169999999999997,0.59589999999999999,0.60619999999999996,0.83020000000000005,0.57894999999999996,0.71289999999999998,0.91100000000000003,1.359]
[null,null,null,null,null,null,null,null,null,null,null,101.1,0.57874999999999999,0.71265000000000001,0.55149999999999999,0.59560000000000002,0.60599999999999998,0.83,0.57874999999999999,0.71265000000000001,0.91060000000000008,1.359]
[null,null,null,null,null,null,null,null,null,null,null,101.2,0.57850000000000001,0.71235000000000004,0.55130000000000001,0.59530000000000005,0.60570000000000002,0.82969999999999999,0.57850000000000001,0.71235000000000004,0.91020000000000001,1.3586]
[null,null,null,null,null,null,null,null,null,null,null,101.3,0.57825000000000004,0.71209999999999996,0.55100000000000005,0.59499999999999997,0.60550000000000004,0.82950000000000002,0.57825000000000004,0.71209999999999996,0.90980000000000005,1.3582000000000001]
[null,null,null,null,null,null,null,null,null,null,null,101.4,0.57804999999999995,0.71184999999999998,0.55079999999999996,0.59470000000000001,0.60529999999999995,0.82930000000000004,0.57804999999999995,0.71184999999999998,0.90939999999999999,1.3578000000000001]
[null,null,null,null,null,null,null,null,null,null,null,101.5,0.57779999999999998,0.71160000000000001,0.55059999999999998,0.59440000000000004,0.60499999999999998,0.82909999999999995,0.57779999999999998,0.71160000000000001,0.90900000000000003,1.3573999999999999]
[null,null,null,null,null,null,null,null,null,null,null,101.6,0.5776,0.71130000000000004,0.5504,0.59409999999999996,0.6048,0.82879999999999998,0.5776,0.71130000000000004,0.90900000000000003,1.357]
[null,null,null,null,null,null,null,null,null,null,null,101.7,0.57740000000000002,0.71104999999999996,0.55020000000000002,0.59379999999999999,0.60460000000000003,0.8286,0.57740000000000002,0.71104999999999996,0.90900000000000003,1.3566]
[null,null,null,null,null,null,null,null,null,null,null,101.8,0.57720000000000005,0.71079999999999999,0.55000000000000004,0.59350000000000003,0.60440000000000005,0.82840000000000003,0.57720000000000005,0.71079999999999999,0.90880000000000005,1.3562000000000001]
[null,null,null,null,null,null,null,null,null,null,null,101.9,0.57799999999999996,0.71055000000000001,0.55189999999999995,0.59319999999999995,0.60409999999999997,0.82820000000000005,0.57799999999999996,0.71055000000000001,0.90839999999999999,1.3558000000000001]
[null,null,null,null,null,null,null,null,null,null,null,102,0.57669999999999999,0.71025000000000005,0.54949999999999999,0.59289999999999998,0.60389999999999999,0.82789999999999997,0.57669999999999999,0.71025000000000005,0.90800000000000003,1.3553999999999999]
[null,null,null,null,null,null,null,null,null,null,null,102.1,0.57650000000000001,0.71,0.54930000000000001,0.59260000000000002,0.60370000000000001,0.82769999999999999,0.57650000000000001,0.71,0.90760000000000007,1.355]
[null,null,null,null,null,null,null,null,null,null,null,102.2,0.57630000000000003,0.70974999999999999,0.54910000000000003,0.59230000000000005,0.60350000000000004,0.82750000000000001,0.57630000000000003,0.70974999999999999,0.90720000000000001,1.3546]
[null,null,null,null,null,null,null,null,null,null,null,102.3,0.57604999999999995,0.70950000000000002,0.54890000000000005,0.59199999999999997,0.60319999999999996,0.82730000000000004,0.57604999999999995,0.70950000000000002,0.90680000000000005,1.3542000000000001]
[null,null,null,null,null,null,null,null,null,null,null,102.4,0.57584999999999997,0.70925000000000005,0.54869999999999997,0.5917,0.60299999999999998,0.82709999999999995,0.57584999999999997,0.70925000000000005,0.90639999999999998,1.3538000000000001]
[null,null,null,null,null,null,null,null,null,null,null,102.5,0.57565,0.70894999999999997,0.54849999999999999,0.59140000000000004,0.6028,0.82679999999999998,0.57565,0.70894999999999997,0.90600000000000003,1.3533999999999999]
[null,null,null,null,null,null,null,null,null,null,null,102.6,0.57545000000000002,0.7087,0.54830000000000001,0.59109999999999996,0.60260000000000002,0.8266,0.57545000000000002,0.7087,0.90560000000000007,1.353]
[null,null,null,null,null,null,null,null,null,null,null,102.7,0.57525000000000004,0.70845000000000002,0.54810000000000003,0.59079999999999999,0.60240000000000005,0.82640000000000002,0.57525000000000004,0.70845000000000002,0.9052,1.3526]
[null,null,null,null,null,null,null,null,null,null,null,102.8,0.57499999999999996,0.70820000000000005,0.54790000000000005,0.59050000000000002,0.60209999999999997,0.82620000000000005,0.57499999999999996,0.70820000000000005,0.90480000000000005,1.3522000000000001]
[null,null,null,null,null,null,null,null,null,null,null,102.9,0.57579999999999998,0.70794999999999997,0.54969999999999997,0.59019999999999995,0.60189999999999999,0.82599999999999996,0.57579999999999998,0.70794999999999997,0.90439999999999998,1.3518000000000001]
[null,null,null,null,null,null,null,null,null,null,null,103,0.5746,0.7077,0.54749999999999999,0.58989999999999998,0.60170000000000001,0.82579999999999998,0.5746,0.7077,0.90400000000000003,1.3513999999999999]
[null,null,null,null,null,null,null,null,null,null,null,103.1,0.57440000000000002,0.70745000000000002,0.54730000000000001,0.58960000000000001,0.60150000000000003,0.8256,0.57440000000000002,0.70745000000000002,0.90400000000000003,1.351]
[null,null,null,null,null,null,null,null,null,null,null,103.2,0.57420000000000004,0.70714999999999995,0.54710000000000003,0.58930000000000005,0.60129999999999995,0.82530000000000003,0.57420000000000004,0.70714999999999995,0.90400000000000003,1.3506]
[null,null,null,null,null,null,null,null,null,null,null,103.3,0.57400000000000007,0.70689999999999997,0.54690000000000005,0.58899999999999997,0.60109999999999997,0.82509999999999994,0.57400000000000007,0.70689999999999997,0.90380000000000005,1.3502000000000001]
[null,null,null,null,null,null,null,null,null,null,null,103.4,0.57379999999999998,0.70665,0.54669999999999996,0.5887,0.60089999999999999,0.82489999999999997,0.57379999999999998,0.70665,0.90339999999999998,1.3498000000000001]
[null,null,null,null,null,null,null,null,null,null,null,103.5,0.57355,0.70640000000000003,0.54649999999999999,0.58840000000000003,0.60060000000000002,0.82469999999999999,0.57355,0.70640000000000003,0.90300000000000002,1.3493999999999999]
[null,null,null,null,null,null,null,null,null,null,null,103.6,0.57335000000000003,0.70615000000000006,0.54630000000000001,0.58809999999999996,0.60040000000000004,0.82450000000000001,0.57335000000000003,0.70615000000000006,0.90260000000000007,1.349]
[null,null,null,null,null,null,null,null,null,null,null,103.7,0.57315000000000005,0.70589999999999997,0.54610000000000003,0.58779999999999999,0.60019999999999996,0.82430000000000003,0.57315000000000005,0.70589999999999997,0.9022,1.3486]
[null,null,null,null,null,null,null,null,null,null,null,103.8,0.57295000000000007,0.70565,0.54590000000000005,0.58750000000000002,0.6,0.82410000000000005,0.57295000000000007,0.70565,0.90180000000000005,1.3482000000000001]
[null,null,null,null,null,null,null,null,null,null,null,103.9,0.57374999999999998,0.70540000000000003,0.54769999999999996,0.58720000000000006,0.5998,0.82389999999999997,0.57374999999999998,0.70540000000000003,0.90139999999999998,1.3480000000000001]
[null,null,null,null,null,null,null,null,null,null,null,104,0.57255,0.70515000000000005,0.54549999999999998,0.58689999999999998,0.59960000000000002,0.82369999999999999,0.57255,0.70515000000000005,0.90100000000000002,1.3480000000000001]
[null,null,null,null,null,null,null,null,null,null,null,104.1,0.57240000000000002,0.70489999999999997,0.5454,0.58660000000000001,0.59940000000000004,0.82350000000000001,0.57240000000000002,0.70489999999999997,0.90060000000000007,1.3480000000000001]
[null,null,null,null,null,null,null,null,null,null,null,104.2,0.57220000000000004,0.70469999999999999,0.54520000000000002,0.58630000000000004,0.59919999999999995,0.82330000000000003,0.57220000000000004,0.70469999999999999,0.9002,1.3476000000000001]
[null,null,null,null,null,null,null,null,null,null,null,104.3,0.57200000000000006,0.70445000000000002,0.54500000000000004,0.58609999999999995,0.59899999999999998,0.82310000000000005,0.57200000000000006,0.70445000000000002,0.89980000000000004,1.3472]
[null,null,null,null,null,null,null,null,null,null,null,104.4,0.57179999999999997,0.70420000000000005,0.54479999999999995,0.58579999999999999,0.5988,0.82289999999999996,0.57179999999999997,0.70420000000000005,0.89939999999999998,1.3468]
[null,null,null,null,null,null,null,null,null,null,null,104.5,0.5716,0.70394999999999996,0.54459999999999997,0.58550000000000002,0.59860000000000002,0.82269999999999999,0.5716,0.70394999999999996,0.89900000000000002,1.3464]
[null,null,null,null,null,null,null,null,null,null,null,104.6,0.57140000000000002,0.70369999999999999,0.5444,0.58520000000000005,0.59840000000000004,0.82250000000000001,0.57140000000000002,0.70369999999999999,0.89900000000000002,1.3460000000000001]
[null,null,null,null,null,null,null,null,null,null,null,104.7,0.57125000000000004,0.70345000000000002,0.54430000000000001,0.58489999999999998,0.59819999999999995,0.82230000000000003,0.57125000000000004,0.70345000000000002,0.89900000000000002,1.3456000000000001]
[null,null,null,null,null,null,null,null,null,null,null,104.8,0.57105000000000006,0.70320000000000005,0.54410000000000003,0.58460000000000001,0.59799999999999998,0.82210000000000005,0.57105000000000006,0.70320000000000005,0.89880000000000004,1.3452]
[null,null,null,null,null,null,null,null,null,null,null,104.9,0.57174999999999998,0.70294999999999996,0.54569999999999996,0.58430000000000004,0.5978,0.82189999999999996,0.57174999999999998,0.70294999999999996,0.89839999999999998,1.3448]
[null,null,null,null,null,null,null,null,null,null,null,105,0.57064999999999999,0.70269999999999999,0.54369999999999996,0.58399999999999996,0.59760000000000002,0.82169999999999999,0.57064999999999999,0.70269999999999999,0.89800000000000002,1.3444]
[null,null,null,null,null,null,null,null,null,null,null,105.1,0.57050000000000001,0.70245000000000002,0.54359999999999997,0.5837,0.59740000000000004,0.82150000000000001,0.57050000000000001,0.70245000000000002,0.89800000000000002,1.3440000000000001]
[null,null,null,null,null,null,null,null,null,null,null,105.2,0.57030000000000003,0.70225000000000004,0.54339999999999999,0.58340000000000003,0.59719999999999995,0.82140000000000002,0.57030000000000003,0.70225000000000004,0.89800000000000002,1.3436000000000001]
[null,null,null,null,null,null,null,null,null,null,null,105.3,0.57010000000000005,0.70199999999999996,0.54320000000000002,0.58309999999999995,0.59699999999999998,0.82120000000000004,0.57010000000000005,0.70199999999999996,0.89780000000000004,1.3431999999999999]
[null,null,null,null,null,null,null,null,null,null,null,105.4,0.56994999999999996,0.70174999999999998,0.54310000000000003,0.58279999999999998,0.5968,0.82099999999999995,0.56994999999999996,0.70174999999999998,0.89739999999999998,1.3428]
[null,null,null,null,null,null,null,null,null,null,null,105.5,0.56974999999999998,0.70155000000000001,0.54290000000000005,0.58250000000000002,0.59660000000000002,0.82079999999999997,0.56974999999999998,0.70155000000000001,0.89700000000000002,1.3424]
[null,null,null,null,null,null,null,null,null,null,null,105.6,0.56955,0.70130000000000003,0.54269999999999996,0.58230000000000004,0.59640000000000004,0.8206,0.56955,0.70130000000000003,0.89660000000000006,1.3420000000000001]
[null,null,null,null,null,null,null,null,null,null,null,105.7,0.56939999999999991,0.70104999999999995,0.54259999999999997,0.58199999999999996,0.59619999999999995,0.82040000000000002,0.56939999999999991,0.70104999999999995,0.8962,1.3416000000000001]
[null,null,null,null,null,null,null,null,null,null,null,105.8,0.56919999999999993,0.70079999999999998,0.54239999999999999,0.58169999999999999,0.59599999999999997,0.82020000000000004,0.56919999999999993,0.70079999999999998,0.89580000000000004,1.3411999999999999]
[null,null,null,null,null,null,null,null,null,null,null,105.9,0.56984999999999997,0.70055000000000001,0.54390000000000005,0.58140000000000003,0.5958,0.82,0.56984999999999997,0.70055000000000001,0.89539999999999997,1.3408]
[null,null,null,null,null,null,null,null,null,null,null,106,0.56885000000000008,0.70030000000000003,0.54210000000000003,0.58109999999999995,0.59560000000000002,0.81979999999999997,0.56885000000000008,0.70030000000000003,0.89500000000000002,1.3404]
[null,null,null,null,null,null,null,null,null,null,null,106.1,0.5686500000000001,0.70009999999999994,0.54190000000000005,0.58079999999999998,0.59540000000000004,0.81969999999999998,0.5686500000000001,0.70009999999999994,0.89460000000000006,1.34]
[null,null,null,null,null,null,null,null,null,null,null,106.2,0.5684499999999999,0.69984999999999997,0.54169999999999996,0.58050000000000002,0.59519999999999995,0.81950000000000001,0.5684499999999999,0.69984999999999997,0.89419999999999999,1.3396000000000001]
[null,null,null,null,null,null,null,null,null,null,null,106.3,0.56830000000000003,0.6996,0.54159999999999997,0.58020000000000005,0.59499999999999997,0.81930000000000003,0.56830000000000003,0.6996,0.89400000000000002,1.3391999999999999]
[null,null,null,null,null,null,null,null,null,null,null,106.4,0.56810000000000005,0.69940000000000002,0.54139999999999999,0.57989999999999997,0.5948,0.81910000000000005,0.56810000000000005,0.69940000000000002,0.89400000000000002,1.3388]
[null,null,null,null,null,null,null,null,null,null,null,106.5,0.56794999999999995,0.69915000000000005,0.5413,0.57969999999999999,0.59460000000000002,0.81889999999999996,0.56794999999999995,0.69915000000000005,0.89400000000000002,1.3384]
[null,null,null,null,null,null,null,null,null,null,null,106.6,0.56780000000000008,0.69894999999999996,0.54110000000000003,0.57940000000000003,0.59450000000000003,0.81879999999999997,0.56780000000000008,0.69894999999999996,0.89360000000000006,1.3380000000000001]
[null,null,null,null,null,null,null,null,null,null,null,106.7,0.56764999999999999,0.69869999999999999,0.54100000000000004,0.57909999999999995,0.59430000000000005,0.81859999999999999,0.56764999999999999,0.69869999999999999,0.89319999999999999,1.3380000000000001]
[null,null,null,null,null,null,null,null,null,null,null,106.8,0.56745000000000001,0.69845000000000002,0.54079999999999995,0.57879999999999998,0.59409999999999996,0.81840000000000002,0.56745000000000001,0.69845000000000002,0.89280000000000004,1.3380000000000001]
[null,null,null,null,null,null,null,null,null,null,null,106.9,0.56804999999999994,0.69820000000000004,0.54220000000000002,0.57850000000000001,0.59389999999999998,0.81820000000000004,0.56804999999999994,0.69820000000000004,0.89239999999999997,1.3378000000000001]
[null,null,null,null,null,null,null,null,null,null,null,107,0.56709999999999994,0.69794999999999996,0.54049999999999998,0.57820000000000005,0.59370000000000001,0.81799999999999995,0.56709999999999994,0.69794999999999996,0.89200000000000002,1.3373999999999999]
[null,null,null,null,null,null,null,null,null,null,null,107.1,0.56695000000000007,0.69774999999999998,0.54039999999999999,0.57789999999999997,0.59350000000000003,0.81789999999999996,0.56695000000000007,0.69774999999999998,0.89200000000000002,1.337]
[null,null,null,null,null,null,null,null,null,null,null,107.2,0.56675000000000009,0.69755,0.54020000000000001,0.5776,0.59330000000000005,0.81769999999999998,0.56675000000000009,0.69755,0.89200000000000002,1.3366]
[null,null,null,null,null,null,null,null,null,null,null,107.3,0.56664999999999999,0.69730000000000003,0.54010000000000002,0.57740000000000002,0.59319999999999995,0.8175,0.56664999999999999,0.69730000000000003,0.89180000000000004,1.3362000000000001]
[null,null,null,null,null,null,null,null,null,null,null,107.4,0.56645000000000001,0.69704999999999995,0.53990000000000005,0.57709999999999995,0.59299999999999997,0.81730000000000003,0.56645000000000001,0.69704999999999995,0.89139999999999997,1.3358000000000001]
[null,null,null,null,null,null,null,null,null,null,null,107.5,0.56630000000000003,0.69684999999999997,0.53979999999999995,0.57679999999999998,0.59279999999999999,0.81720000000000004,0.56630000000000003,0.69684999999999997,0.89100000000000001,1.3353999999999999]
[null,null,null,null,null,null,null,null,null,null,null,107.6,0.56610000000000005,0.6966,0.53959999999999997,0.57650000000000001,0.59260000000000002,0.81699999999999995,0.56610000000000005,0.6966,0.89060000000000006,1.335]
[null,null,null,null,null,null,null,null,null,null,null,107.7,0.56594999999999995,0.69635000000000002,0.53949999999999998,0.57620000000000005,0.59240000000000004,0.81679999999999997,0.56594999999999995,0.69635000000000002,0.89019999999999999,1.3346]
[null,null,null,null,null,null,null,null,null,null,null,107.8,0.56580000000000008,0.69620000000000004,0.5393,0.57589999999999997,0.59230000000000005,0.81669999999999998,0.56580000000000008,0.69620000000000004,0.89,1.3342000000000001]
[null,null,null,null,null,null,null,null,null,null,null,107.9,0.56640000000000001,0.69594999999999996,0.54069999999999996,0.57569999999999999,0.59209999999999996,0.8165,0.56640000000000001,0.69594999999999996,0.89,1.3338000000000001]
[null,null,null,null,null,null,null,null,null,null,null,108,0.5655,0.69569999999999999,0.53910000000000002,0.57540000000000002,0.59189999999999998,0.81630000000000003,0.5655,0.69569999999999999,0.89,1.3333999999999999]
[null,null,null,null,null,null,null,null,null,null,null,108.1,0.56530000000000002,0.69545000000000001,0.53890000000000005,0.57509999999999994,0.5917,0.81610000000000005,0.56530000000000002,0.69545000000000001,0.88960000000000006,1.333]
[null,null,null,null,null,null,null,null,null,null,null,108.2,0.56519999999999992,0.69525000000000003,0.53879999999999995,0.57479999999999998,0.59160000000000001,0.81599999999999995,0.56519999999999992,0.69525000000000003,0.88919999999999999,1.3326]
[null,null,null,null,null,null,null,null,null,null,null,108.3,0.56499999999999995,0.69499999999999995,0.53859999999999997,0.57450000000000001,0.59140000000000004,0.81579999999999997,0.56499999999999995,0.69499999999999995,0.88900000000000001,1.3322000000000001]
[null,null,null,null,null,null,null,null,null,null,null,108.4,0.56484999999999996,0.69479999999999997,0.53849999999999998,0.57420000000000004,0.59119999999999995,0.81559999999999999,0.56484999999999996,0.69479999999999997,0.88900000000000001,1.3318000000000001]
[null,null,null,null,null,null,null,null,null,null,null,108.5,0.56469999999999998,0.6946,0.53839999999999999,0.57399999999999995,0.59099999999999997,0.8155,0.56469999999999998,0.6946,0.88900000000000001,1.3313999999999999]
[null,null,null,null,null,null,null,null,null,null,null,108.6,0.56455,0.69435000000000002,0.53820000000000001,0.57369999999999999,0.59089999999999998,0.81530000000000002,0.56455,0.69435000000000002,0.88860000000000006,1.331]
[null,null,null,null,null,null,null,null,null,null,null,108.7,0.56440000000000001,0.69415000000000004,0.53810000000000002,0.57340000000000002,0.5907,0.81520000000000004,0.56440000000000001,0.69415000000000004,0.88819999999999999,1.331]
[null,null,null,null,null,null,null,null,null,null,null,108.8,0.56425000000000003,0.69389999999999996,0.53800000000000003,0.57310000000000005,0.59050000000000002,0.81499999999999995,0.56425000000000003,0.69389999999999996,0.88780000000000003,1.331]
[null,null,null,null,null,null,null,null,null,null,null,108.9,0.56475000000000009,0.69364999999999999,0.53920000000000001,0.57279999999999998,0.59030000000000005,0.81479999999999997,0.56475000000000009,0.69364999999999999,0.88739999999999997,1.3308]
[null,null,null,null,null,null,null,null,null,null,null,109,0.56394999999999995,0.69350000000000001,0.53769999999999996,0.57250000000000001,0.59019999999999995,0.81469999999999998,0.56394999999999995,0.69350000000000001,0.88700000000000001,1.3304]
[null,null,null,null,null,null,null,null,null,null,null,109.1,0.56379999999999997,0.69325000000000003,0.53759999999999997,0.57230000000000003,0.59,0.8145,0.56379999999999997,0.69325000000000003,0.88700000000000001,1.33]
[null,null,null,null,null,null,null,null,null,null,null,109.2,0.56364999999999998,0.69299999999999995,0.53749999999999998,0.57199999999999995,0.58979999999999999,0.81430000000000002,0.56364999999999998,0.69299999999999995,0.88700000000000001,1.3296000000000001]
[null,null,null,null,null,null,null,null,null,null,null,109.3,0.5635,0.69279999999999997,0.5373,0.57169999999999999,0.5897,0.81420000000000003,0.5635,0.69279999999999997,0.88680000000000003,1.3291999999999999]
[null,null,null,null,null,null,null,null,null,null,null,109.4,0.56335000000000002,0.69255,0.53720000000000001,0.57140000000000002,0.58950000000000002,0.81399999999999995,0.56335000000000002,0.69255,0.88639999999999997,1.3288]
[null,null,null,null,null,null,null,null,null,null,null,109.5,0.56320000000000003,0.69240000000000002,0.53710000000000002,0.57110000000000005,0.58930000000000005,0.81389999999999996,0.56320000000000003,0.69240000000000002,0.88600000000000001,1.3284]
[null,null,null,null,null,null,null,null,null,null,null,109.6,0.56309999999999993,0.69215000000000004,0.53700000000000003,0.57089999999999996,0.58919999999999995,0.81369999999999998,0.56309999999999993,0.69215000000000004,0.88560000000000005,1.3280000000000001]
[null,null,null,null,null,null,null,null,null,null,null,109.7,0.56289999999999996,0.69189999999999996,0.53680000000000005,0.5706,0.58899999999999997,0.8135,0.56289999999999996,0.69189999999999996,0.88519999999999999,1.3276000000000001]
[null,null,null,null,null,null,null,null,null,null,null,109.8,0.56274999999999997,0.69169999999999998,0.53669999999999995,0.57030000000000003,0.58879999999999999,0.81340000000000001,0.56274999999999997,0.69169999999999998,0.88500000000000001,1.3271999999999999]
[null,null,null,null,null,null,null,null,null,null,null,109.9,0.56325000000000003,0.6915,0.53779999999999994,0.56999999999999995,0.5887,0.81320000000000003,0.56325000000000003,0.6915,0.88500000000000001,1.3268]
[null,null,null,null,null,null,null,null,null,null,null,110,0.5625,0.69135000000000002,0.53649999999999998,0.56979999999999997,0.58850000000000002,0.81310000000000004,0.5625,0.69135000000000002,0.88500000000000001,1.3264]
[null,null,null,null,null,null,null,null,null,null,null,110.1,0.56235000000000002,0.69120000000000004,0.53639999999999999,0.5696,0.58830000000000005,0.81289999999999996,0.56235000000000002,0.69120000000000004,0.88460000000000005,1.3260000000000001]
[null,null,null,null,null,null,null,null,null,null,null,110.2,0.56220000000000003,0.69105000000000005,0.53620000000000001,0.56950000000000001,0.58819999999999995,0.81279999999999997,0.56220000000000003,0.69105000000000005,0.88419999999999999,1.3256000000000001]
[null,null,null,null,null,null,null,null,null,null,null,110.3,0.56204999999999994,0.69089999999999996,0.53610000000000002,0.56930000000000003,0.58799999999999997,0.81259999999999999,0.56204999999999994,0.69089999999999996,0.88380000000000003,1.3251999999999999]
[null,null,null,null,null,null,null,null,null,null,null,110.4,0.56190000000000007,0.69074999999999998,0.53600000000000003,0.56920000000000004,0.58779999999999999,0.81240000000000001,0.56190000000000007,0.69074999999999998,0.88339999999999996,1.3248]
[null,null,null,null,null,null,null,null,null,null,null,110.5,0.56180000000000008,0.69059999999999999,0.53590000000000004,0.56940000000000002,0.5877,0.81230000000000002,0.56180000000000008,0.69059999999999999,0.88300000000000001,1.3244]
[null,null,null,null,null,null,null,null,null,null,null,110.6,0.56164999999999998,0.69045000000000001,0.53580000000000005,0.56889999999999996,0.58750000000000002,0.81210000000000004,0.56164999999999998,0.69045000000000001,0.88300000000000001,1.3240000000000001]
[null,null,null,null,null,null,null,null,null,null,null,110.7,0.56154999999999999,0.69030000000000002,0.53569999999999995,0.56879999999999997,0.58740000000000003,0.81200000000000006,0.56154999999999999,0.69030000000000002,0.88300000000000001,1.3236000000000001]
[null,null,null,null,null,null,null,null,null,null,null,110.8,0.56135000000000002,0.69015000000000004,0.53549999999999998,0.56859999999999999,0.58720000000000006,0.81179999999999997,0.56135000000000002,0.69015000000000004,0.88280000000000003,1.3231999999999999]
[null,null,null,null,null,null,null,null,null,null,null,110.9,0.56179999999999997,0.69005000000000005,0.53659999999999997,0.56850000000000001,0.58699999999999997,0.81169999999999998,0.56179999999999997,0.69005000000000005,0.88239999999999996,1.323]
[null,null,null,null,null,null,null,null,null,null,null,111,0.56109999999999993,0.68984999999999996,0.5353,0.56840000000000002,0.58689999999999998,0.8115,0.56109999999999993,0.68984999999999996,0.88200000000000001,1.323]
[null,null,null,null,null,null,null,null,null,null,null,111.1,0.56095000000000006,0.68974999999999997,0.53520000000000001,0.56809999999999994,0.5867,0.81140000000000001,0.56095000000000006,0.68974999999999997,0.88160000000000005,1.323]
[null,null,null,null,null,null,null,null,null,null,null,111.2,0.56085000000000007,0.68959999999999999,0.53510000000000002,0.56799999999999995,0.58660000000000001,0.81120000000000003,0.56085000000000007,0.68959999999999999,0.88119999999999998,1.3226]
[null,null,null,null,null,null,null,null,null,null,null,111.3,0.56069999999999998,0.68945000000000001,0.53500000000000003,0.56779999999999997,0.58640000000000003,0.81110000000000004,0.56069999999999998,0.68945000000000001,0.88100000000000001,1.3222]
[null,null,null,null,null,null,null,null,null,null,null,111.4,0.56059999999999999,0.68930000000000002,0.53490000000000004,0.56770000000000009,0.58630000000000004,0.81089999999999995,0.56059999999999999,0.68930000000000002,0.88100000000000001,1.3218000000000001]
[null,null,null,null,null,null,null,null,null,null,null,111.5,0.56045,0.68915000000000004,0.53480000000000005,0.5675,0.58609999999999995,0.81079999999999997,0.56045,0.68915000000000004,0.88100000000000001,1.3213999999999999]
[null,null,null,null,null,null,null,null,null,null,null,111.6,0.5603499999999999,0.68899999999999995,0.53469999999999995,0.5673999999999999,0.58599999999999997,0.81059999999999999,0.5603499999999999,0.68899999999999995,0.88060000000000005,1.321]
[null,null,null,null,null,null,null,null,null,null,null,111.7,0.56020000000000003,0.68889999999999996,0.53459999999999996,0.56729999999999992,0.58579999999999999,0.8105,0.56020000000000003,0.68889999999999996,0.88019999999999998,1.3206]
[null,null,null,null,null,null,null,null,null,null,null,111.8,0.56004999999999994,0.68869999999999998,0.53449999999999998,0.56709999999999994,0.58560000000000001,0.81030000000000002,0.56004999999999994,0.68869999999999998,0.87980000000000003,1.3202]
[null,null,null,null,null,null,null,null,null,null,null,111.9,0.56045,0.68859999999999999,0.53539999999999999,0.56699999999999995,0.58550000000000002,0.81020000000000003,0.56045,0.68859999999999999,0.87939999999999996,1.3198000000000001]
[null,null,null,null,null,null,null,null,null,null,null,112,0.55974999999999997,0.6885,0.53420000000000001,0.56689999999999996,0.58530000000000004,0.81010000000000004,0.55974999999999997,0.6885,0.879,1.3193999999999999]
[null,null,null,null,null,null,null,null,null,null,null,112.1,0.55964999999999998,0.68830000000000002,0.53410000000000002,0.56670000000000009,0.58520000000000005,0.80989999999999995,0.55964999999999998,0.68830000000000002,0.879,1.319]
[null,null,null,null,null,null,null,null,null,null,null,112.2,0.5595,0.68820000000000003,0.53400000000000003,0.5666000000000001,0.58499999999999996,0.80979999999999996,0.5595,0.68820000000000003,0.879,1.319]
[null,null,null,null,null,null,null,null,null,null,null,112.3,0.55940000000000001,0.68799999999999994,0.53390000000000004,0.5663999999999999,0.58489999999999998,0.80959999999999999,0.55940000000000001,0.68799999999999994,0.87880000000000003,1.319]
[null,null,null,null,null,null,null,null,null,null,null,112.4,0.55925000000000002,0.68789999999999996,0.53380000000000005,0.56629999999999991,0.5847,0.8095,0.55925000000000002,0.68789999999999996,0.87839999999999996,1.3188]
[null,null,null,null,null,null,null,null,null,null,null,112.5,0.55915000000000004,0.68774999999999997,0.53369999999999995,0.56619999999999993,0.58460000000000001,0.80930000000000002,0.55915000000000004,0.68774999999999997,0.878,1.3184]
[null,null,null,null,null,null,null,null,null,null,null,112.6,0.55899999999999994,0.68759999999999999,0.53359999999999996,0.56599999999999995,0.58440000000000003,0.80920000000000003,0.55899999999999994,0.68759999999999999,0.878,1.3180000000000001]
[null,null,null,null,null,null,null,null,null,null,null,112.7,0.55889999999999995,0.68745000000000001,0.53349999999999997,0.56589999999999996,0.58430000000000004,0.80900000000000005,0.55889999999999995,0.68745000000000001,0.878,1.3180000000000001]
[null,null,null,null,null,null,null,null,null,null,null,112.8,0.55874999999999997,0.68735000000000002,0.53339999999999999,0.56580000000000008,0.58409999999999995,0.80889999999999995,0.55874999999999997,0.68735000000000002,0.87780000000000002,1.3180000000000001]
[null,null,null,null,null,null,null,null,null,null,null,112.9,0.55915000000000004,0.68720000000000003,0.5343,0.5656000000000001,0.58399999999999996,0.80879999999999996,0.55915000000000004,0.68720000000000003,0.87739999999999996,1.3180000000000001]
[null,null,null,null,null,null,null,null,null,null,null,113,0.55854999999999999,0.68705000000000005,0.53320000000000001,0.56550000000000011,0.58389999999999997,0.80859999999999999,0.55854999999999999,0.68705000000000005,0.877,1.3180000000000001]
[null,null,null,null,null,null,null,null,null,null,null,113.1,0.55840000000000001,0.68689999999999996,0.53310000000000002,0.56529999999999991,0.5837,0.8085,0.55840000000000001,0.68689999999999996,0.87660000000000005,1.3180000000000001]
[null,null,null,null,null,null,null,null,null,null,null,113.2,0.55830000000000002,0.68674999999999997,0.53300000000000003,0.56519999999999992,0.58360000000000001,0.80830000000000002,0.55830000000000002,0.68674999999999997,0.87619999999999998,1.3180000000000001]
[null,null,null,null,null,null,null,null,null,null,null,113.3,0.55815000000000003,0.68664999999999998,0.53290000000000004,0.56509999999999994,0.58340000000000003,0.80820000000000003,0.55815000000000003,0.68664999999999998,0.876,1.3180000000000001]
[null,null,null,null,null,null,null,null,null,null,null,113.4,0.55805000000000005,0.6865,0.53280000000000005,0.56489999999999996,0.58330000000000004,0.80810000000000004,0.55805000000000005,0.6865,0.876,1.3178000000000001]
[null,null,null,null,null,null,null,null,null,null,null,113.5,0.55794999999999995,0.68635000000000002,0.53280000000000005,0.56480000000000008,0.58309999999999995,0.80789999999999995,0.55794999999999995,0.68635000000000002,0.876,1.3173999999999999]
[null,null,null,null,null,null,null,null,null,null,null,113.6,0.55784999999999996,0.68625000000000003,0.53269999999999995,0.56470000000000009,0.58299999999999996,0.80779999999999996,0.55784999999999996,0.68625000000000003,0.87560000000000004,1.3169999999999999]
[null,null,null,null,null,null,null,null,null,null,null,113.7,0.55769999999999997,0.68610000000000004,0.53259999999999996,0.56450000000000011,0.58279999999999998,0.80769999999999997,0.55769999999999997,0.68610000000000004,0.87519999999999998,1.3169999999999999]
[null,null,null,null,null,null,null,null,null,null,null,113.8,0.55759999999999998,0.68594999999999995,0.53249999999999997,0.5643999999999999,0.5827,0.8075,0.55759999999999998,0.68594999999999995,0.875,1.3169999999999999]
[null,null,null,null,null,null,null,null,null,null,null,113.9,0.55794999999999995,0.68584999999999996,0.5333,0.56429999999999991,0.58260000000000001,0.80740000000000001,0.55794999999999995,0.68584999999999996,0.875,1.3168]
[null,null,null,null,null,null,null,null,null,null,null,114,0.55735000000000001,0.68564999999999998,0.5323,0.56409999999999993,0.58240000000000003,0.80720000000000003,0.55735000000000001,0.68564999999999998,0.875,1.3164]
[null,null,null,null,null,null,null,null,null,null,null,114.1,0.55725000000000002,0.68554999999999999,0.53220000000000001,0.56399999999999995,0.58230000000000004,0.80710000000000004,0.55725000000000002,0.68554999999999999,0.87460000000000004,1.3160000000000001]
[null,null,null,null,null,null,null,null,null,null,null,114.2,0.55709999999999993,0.68540000000000001,0.53210000000000002,0.56379999999999997,0.58209999999999995,0.80700000000000005,0.55709999999999993,0.68540000000000001,0.87419999999999998,1.3160000000000001]
[null,null,null,null,null,null,null,null,null,null,null,114.3,0.55699999999999994,0.68525000000000003,0.53200000000000003,0.56370000000000009,0.58199999999999996,0.80679999999999996,0.55699999999999994,0.68525000000000003,0.87380000000000002,1.3160000000000001]
[null,null,null,null,null,null,null,null,null,null,null,114.4,0.55689999999999995,0.68515000000000004,0.53190000000000004,0.5636000000000001,0.58189999999999997,0.80669999999999997,0.55689999999999995,0.68515000000000004,0.87339999999999995,1.3158000000000001]
[null,null,null,null,null,null,null,null,null,null,null,114.5,0.55675000000000008,0.68500000000000005,0.53180000000000005,0.56340000000000012,0.58169999999999999,0.80659999999999998,0.55675000000000008,0.68500000000000005,0.873,1.3153999999999999]
[null,null,null,null,null,null,null,null,null,null,null,114.6,0.55664999999999998,0.68484999999999996,0.53169999999999995,0.56329999999999991,0.58160000000000001,0.80640000000000001,0.55664999999999998,0.68484999999999996,0.873,1.3149999999999999]
[null,null,null,null,null,null,null,null,null,null,null,114.7,0.55654999999999999,0.68474999999999997,0.53159999999999996,0.56319999999999992,0.58150000000000002,0.80630000000000002,0.55654999999999999,0.68474999999999997,0.873,1.3149999999999999]
[null,null,null,null,null,null,null,null,null,null,null,114.8,0.55645,0.68459999999999999,0.53159999999999996,0.56299999999999994,0.58130000000000004,0.80620000000000003,0.55645,0.68459999999999999,0.873,1.3149999999999999]
[null,null,null,null,null,null,null,null,null,null,null,114.9,0.55679999999999996,0.68445,0.53239999999999998,0.56289999999999996,0.58120000000000005,0.80600000000000005,0.55679999999999996,0.68445,0.873,1.3148]
[null,null,null,null,null,null,null,null,null,null,null,115,0.55625000000000002,0.68435000000000001,0.53139999999999998,0.56280000000000008,0.58109999999999995,0.80589999999999995,0.55625000000000002,0.68435000000000001,0.873,1.3144]
[null,null,null,null,null,null,null,null,null,null,null,115.1,0.55610000000000004,0.68420000000000003,0.53129999999999999,0.5626000000000001,0.58089999999999997,0.80579999999999996,0.55610000000000004,0.68420000000000003,0.87260000000000004,1.3140000000000001]
[null,null,null,null,null,null,null,null,null,null,null,115.2,0.55600000000000005,0.68405000000000005,0.53120000000000001,0.5625,0.58079999999999998,0.80559999999999998,0.55600000000000005,0.68405000000000005,0.87219999999999998,1.3140000000000001]
[null,null,null,null,null,null,null,null,null,null,null,115.3,0.55584999999999996,0.68389999999999995,0.53110000000000002,0.56229999999999991,0.5806,0.80549999999999999,0.55584999999999996,0.68389999999999995,0.872,1.3140000000000001]
[null,null,null,null,null,null,null,null,null,null,null,115.4,0.55574999999999997,0.68379999999999996,0.53100000000000003,0.56219999999999992,0.58050000000000002,0.8054,0.55574999999999997,0.68379999999999996,0.872,1.3138000000000001]
[null,null,null,null,null,null,null,null,null,null,null,115.5,0.55564999999999998,0.68364999999999998,0.53090000000000004,0.56209999999999993,0.58040000000000003,0.80520000000000003,0.55564999999999998,0.68364999999999998,0.872,1.3133999999999999]
[null,null,null,null,null,null,null,null,null,null,null,115.6,0.55560000000000009,0.6835,0.53090000000000004,0.56189999999999996,0.58030000000000004,0.80510000000000004,0.55560000000000009,0.6835,0.87160000000000004,1.3129999999999999]
[null,null,null,null,null,null,null,null,null,null,null,115.7,0.55545,0.68340000000000001,0.53080000000000005,0.56179999999999997,0.58009999999999995,0.80500000000000005,0.55545,0.68340000000000001,0.87119999999999997,1.3129999999999999]
[null,null,null,null,null,null,null,null,null,null,null,115.8,0.55535000000000001,0.68330000000000002,0.53069999999999995,0.56170000000000009,0.57999999999999996,0.80489999999999995,0.55535000000000001,0.68330000000000002,0.871,1.3129999999999999]
[null,null,null,null,null,null,null,null,null,null,null,115.9,0.55569999999999997,0.68310000000000004,0.53149999999999997,0.56150000000000011,0.57989999999999997,0.80469999999999997,0.55569999999999997,0.68310000000000004,0.871,1.3128]
[null,null,null,null,null,null,null,null,null,null,null,116,0.55509999999999993,0.68300000000000005,0.53049999999999997,0.56140000000000012,0.57969999999999999,0.80459999999999998,0.55509999999999993,0.68300000000000005,0.871,1.3124]
[null,null,null,null,null,null,null,null,null,null,null,116.1,0.55500000000000005,0.68289999999999995,0.53039999999999998,0.56129999999999991,0.5796,0.80449999999999999,0.55500000000000005,0.68289999999999995,0.87060000000000004,1.3120000000000001]
[null,null,null,null,null,null,null,null,null,null,null,116.2,0.55489999999999995,0.68269999999999997,0.53029999999999999,0.56109999999999993,0.57950000000000002,0.80430000000000001,0.55489999999999995,0.68269999999999997,0.87019999999999997,1.3120000000000001]
[null,null,null,null,null,null,null,null,null,null,null,116.3,0.55475000000000008,0.68259999999999998,0.5302,0.56099999999999994,0.57930000000000004,0.80420000000000003,0.55475000000000008,0.68259999999999998,0.87,1.3120000000000001]
[null,null,null,null,null,null,null,null,null,null,null,116.4,0.55469999999999997,0.6825,0.5302,0.56089999999999995,0.57920000000000005,0.80410000000000004,0.55469999999999997,0.6825,0.87,1.3118000000000001]
[null,null,null,null,null,null,null,null,null,null,null,116.5,0.55459999999999998,0.68235000000000001,0.53010000000000002,0.56069999999999998,0.57909999999999995,0.80400000000000005,0.55459999999999998,0.68235000000000001,0.87,1.3113999999999999]
[null,null,null,null,null,null,null,null,null,null,null,116.6,0.55449999999999999,0.68220000000000003,0.53,0.5606000000000001,0.57899999999999996,0.80379999999999996,0.55449999999999999,0.68220000000000003,0.86960000000000004,1.3109999999999999]
[null,null,null,null,null,null,null,null,null,null,null,116.7,0.55435000000000001,0.68210000000000004,0.52990000000000004,0.56050000000000011,0.57879999999999998,0.80369999999999997,0.55435000000000001,0.68210000000000004,0.86919999999999997,1.3109999999999999]
[null,null,null,null,null,null,null,null,null,null,null,116.8,0.55425000000000002,0.68194999999999995,0.52980000000000005,0.56029999999999991,0.57869999999999999,0.80359999999999998,0.55425000000000002,0.68194999999999995,0.86899999999999999,1.3109999999999999]
[null,null,null,null,null,null,null,null,null,null,null,116.9,0.55459999999999998,0.68179999999999996,0.53059999999999996,0.56019999999999992,0.5786,0.8034,0.55459999999999998,0.68179999999999996,0.86899999999999999,1.3108]
[null,null,null,null,null,null,null,null,null,null,null,117,0.55404999999999993,0.68169999999999997,0.52959999999999996,0.56009999999999993,0.57850000000000001,0.80330000000000001,0.55404999999999993,0.68169999999999997,0.86899999999999999,1.3104]
[null,null,null,null,null,null,null,null,null,null,null,117.1,0.55394999999999994,0.68154999999999999,0.52959999999999996,0.55989999999999995,0.57830000000000004,0.80320000000000003,0.55394999999999994,0.68154999999999999,0.86860000000000004,1.31]
[null,null,null,null,null,null,null,null,null,null,null,117.2,0.55384999999999995,0.68145,0.52949999999999997,0.55979999999999996,0.57820000000000005,0.80310000000000004,0.55384999999999995,0.68145,0.86819999999999997,1.31]
[null,null,null,null,null,null,null,null,null,null,null,117.3,0.55374999999999996,0.68130000000000002,0.52939999999999998,0.55970000000000009,0.57809999999999995,0.80289999999999995,0.55374999999999996,0.68130000000000002,0.86799999999999999,1.31]
[null,null,null,null,null,null,null,null,null,null,null,117.4,0.55364999999999998,0.68115000000000003,0.52929999999999999,0.55950000000000011,0.57799999999999996,0.80279999999999996,0.55364999999999998,0.68115000000000003,0.86799999999999999,1.3098000000000001]
[null,null,null,null,null,null,null,null,null,null,null,117.5,0.55349999999999999,0.68105000000000004,0.5292,0.55940000000000012,0.57779999999999998,0.80269999999999997,0.55349999999999999,0.68105000000000004,0.86799999999999999,1.3093999999999999]
[null,null,null,null,null,null,null,null,null,null,null,117.6,0.5534,0.68095000000000006,0.52910000000000001,0.55930000000000013,0.57769999999999999,0.80259999999999998,0.5534,0.68095000000000006,0.86799999999999999,1.3089999999999999]
[null,null,null,null,null,null,null,null,null,null,null,117.7,0.55330000000000001,0.68074999999999997,0.52900000000000003,0.55909999999999993,0.5776,0.8024,0.55330000000000001,0.68074999999999997,0.86799999999999999,1.3089999999999999]
[null,null,null,null,null,null,null,null,null,null,null,117.8,0.55325000000000002,0.68064999999999998,0.52900000000000003,0.55899999999999994,0.57750000000000001,0.80230000000000001,0.55325000000000002,0.68064999999999998,0.86780000000000002,1.3089999999999999]
[null,null,null,null,null,null,null,null,null,null,null,117.9,0.55354999999999999,0.68054999999999999,0.52969999999999995,0.55889999999999995,0.57740000000000002,0.80220000000000002,0.55354999999999999,0.68054999999999999,0.86739999999999995,1.3089999999999999]
[null,null,null,null,null,null,null,null,null,null,null,118,0.55300000000000005,0.6804,0.52880000000000005,0.55869999999999997,0.57720000000000005,0.80210000000000004,0.55300000000000005,0.6804,0.86699999999999999,1.3089999999999999]
[null,null,null,null,null,null,null,null,null,null,null,118.1,0.55289999999999995,0.68030000000000002,0.52869999999999995,0.55859999999999999,0.57709999999999995,0.80200000000000005,0.55289999999999995,0.68030000000000002,0.86699999999999999,1.3089999999999999]
[null,null,null,null,null,null,null,null,null,null,null,118.2,0.55279999999999996,0.68015000000000003,0.52859999999999996,0.55850000000000011,0.57699999999999996,0.80179999999999996,0.55279999999999996,0.68015000000000003,0.86699999999999999,1.3086]
[null,null,null,null,null,null,null,null,null,null,null,118.3,0.55269999999999997,0.68,0.52849999999999997,0.55830000000000013,0.57689999999999997,0.80169999999999997,0.55269999999999997,0.68,0.86680000000000001,1.3082]
[null,null,null,null,null,null,null,null,null,null,null,118.4,0.55259999999999998,0.67989999999999995,0.52839999999999998,0.55819999999999992,0.57679999999999998,0.80159999999999998,0.55259999999999998,0.67989999999999995,0.86639999999999995,1.3080000000000001]
[null,null,null,null,null,null,null,null,null,null,null,118.5,0.55245,0.67979999999999996,0.52829999999999999,0.55809999999999993,0.5766,0.80149999999999999,0.55245,0.67979999999999996,0.86599999999999999,1.3080000000000001]
[null,null,null,null,null,null,null,null,null,null,null,118.6,0.5524,0.67959999999999998,0.52829999999999999,0.55789999999999995,0.57650000000000001,0.80130000000000001,0.5524,0.67959999999999998,0.86599999999999999,1.3080000000000001]
[null,null,null,null,null,null,null,null,null,null,null,118.7,0.55230000000000001,0.67949999999999999,0.5282,0.55779999999999996,0.57640000000000002,0.80120000000000002,0.55230000000000001,0.67949999999999999,0.86599999999999999,1.3076000000000001]
[null,null,null,null,null,null,null,null,null,null,null,118.8,0.55220000000000002,0.6794,0.52810000000000001,0.55769999999999997,0.57630000000000003,0.80110000000000003,0.55220000000000002,0.6794,0.86599999999999999,1.3071999999999999]
[null,null,null,null,null,null,null,null,null,null,null,118.9,0.5525500000000001,0.67925000000000002,0.52890000000000004,0.5575,0.57620000000000005,0.80100000000000005,0.5525500000000001,0.67925000000000002,0.86599999999999999]
[null,null,null,null,null,null,null,null,null,null,null,119,0.55200000000000005,0.67915000000000003,0.52790000000000004,0.55740000000000012,0.57609999999999995,0.80089999999999995,0.55200000000000005,0.67915000000000003,0.86599999999999999]
[null,null,null,null,null,null,null,null,null,null,null,119.1,0.55184999999999995,0.67900000000000005,0.52780000000000005,0.55730000000000013,0.57589999999999997,0.80069999999999997,0.55184999999999995,0.67900000000000005,0.86560000000000004]
[null,null,null,null,null,null,null,null,null,null,null,119.2,0.55174999999999996,0.67884999999999995,0.52769999999999995,0.55709999999999993,0.57579999999999998,0.80059999999999998,0.55174999999999996,0.67884999999999995,0.86519999999999997]
[null,null,null,null,null,null,null,null,null,null,null,119.3,0.55164999999999997,0.67874999999999996,0.52759999999999996,0.55699999999999994,0.57569999999999999,0.80049999999999999,0.55164999999999997,0.67874999999999996,0.86499999999999999]
[null,null,null,null,null,null,null,null,null,null,null,119.4,0.55154999999999998,0.67864999999999998,0.52749999999999997,0.55689999999999995,0.5756,0.8004,0.55154999999999998,0.67864999999999998,0.86499999999999999]
[null,null,null,null,null,null,null,null,null,null,null,119.5,0.55145,0.67849999999999999,0.52739999999999998,0.55669999999999997,0.57550000000000001,0.80030000000000001,0.55145,0.67849999999999999,0.86499999999999999]
[null,null,null,null,null,null,null,null,null,null,null,119.6,0.5514,0.67835000000000001,0.52739999999999998,0.55659999999999998,0.57540000000000002,0.80010000000000003,0.5514,0.67835000000000001,0.86460000000000004]
[null,null,null,null,null,null,null,null,null,null,null,119.7,0.55130000000000001,0.67825000000000002,0.52729999999999999,0.55649999999999999,0.57530000000000003,0.8,0.55130000000000001,0.67825000000000002,0.86419999999999997]
[null,null,null,null,null,null,null,null,null,null,null,119.8,0.55115000000000003,0.67810000000000004,0.5272,0.55630000000000002,0.57509999999999994,0.79990000000000006,0.55115000000000003,0.67810000000000004,0.86399999999999999]
[null,null,null,null,null,null,null,null,null,null,null,119.9,0.55149999999999999,0.67800000000000005,0.52800000000000002,0.55620000000000014,0.57499999999999996,0.79979999999999996,0.55149999999999999,0.67800000000000005,0.86399999999999999]
[null,null,null,null,null,null,null,null,null,null,null,120,0.55095000000000005,0.67789999999999995,0.52700000000000002,0.55609999999999993,0.57489999999999997,0.79969999999999997,0.55095000000000005,0.67789999999999995,0.86399999999999999]
[null,null,null,null,null,null,null,null,null,null,null,120.1,0.55085000000000006,0.67769999999999997,0.52690000000000003,0.55589999999999995,0.57479999999999998,0.79949999999999999,0.55085000000000006,0.67769999999999997,0.86399999999999999]
[null,null,null,null,null,null,null,null,null,null,null,120.2,0.55075000000000007,0.67759999999999998,0.52680000000000005,0.55579999999999996,0.57469999999999999,0.7994,0.55075000000000007,0.67759999999999998,0.86399999999999999]
[null,null,null,null,null,null,null,null,null,null,null,120.3,0.55064999999999997,0.67749999999999999,0.52669999999999995,0.55569999999999997,0.5746,0.79930000000000001,0.55064999999999997,0.67749999999999999,0.86380000000000001]
[null,null,null,null,null,null,null,null,null,null,null,120.4,0.55054999999999998,0.67735000000000001,0.52659999999999996,0.55549999999999999,0.57450000000000001,0.79920000000000002,0.55054999999999998,0.67735000000000001,0.86339999999999995]
[null,null,null,null,null,null,null,null,null,null,null,120.5,0.55044999999999999,0.67725000000000002,0.52649999999999997,0.5554,0.57440000000000002,0.79910000000000003,0.55044999999999999,0.67725000000000002,0.86299999999999999]
[null,null,null,null,null,null,null,null,null,null,null,120.6,0.55035000000000001,0.67710000000000004,0.52639999999999998,0.55530000000000002,0.57430000000000003,0.79890000000000005,0.55035000000000001,0.67710000000000004,0.86299999999999999]
[null,null,null,null,null,null,null,null,null,null,null,120.7,0.55025000000000002,0.67695000000000005,0.52629999999999999,0.55510000000000015,0.57420000000000004,0.79879999999999995,0.55025000000000002,0.67695000000000005,0.86299999999999999]
[null,null,null,null,null,null,null,null,null,null,null,120.8,0.55010000000000003,0.67684999999999995,0.5262,0.55500000000000005,0.57399999999999995,0.79869999999999997,0.55010000000000003,0.67684999999999995,0.86280000000000001]
[null,null,null,null,null,null,null,null,null,null,null,120.9,0.55049999999999999,0.67674999999999996,0.52710000000000001,0.55489999999999995,0.57389999999999997,0.79859999999999998,0.55049999999999999,0.67674999999999996,0.86239999999999994]
[null,null,null,null,null,null,null,null,null,null,null,121,0.54990000000000006,0.67659999999999998,0.52600000000000002,0.55469999999999997,0.57379999999999998,0.79849999999999999,0.54990000000000006,0.67659999999999998,0.86199999999999999]
[null,null,null,null,null,null,null,null,null,null,null,121.1,0.54980000000000007,0.67649999999999999,0.52590000000000003,0.55459999999999998,0.57369999999999999,0.7984,0.54980000000000007,0.67649999999999999,0.86199999999999999]
[null,null,null,null,null,null,null,null,null,null,null,121.2,0.54970000000000008,0.67635000000000001,0.52580000000000005,0.55449999999999999,0.5736,0.79820000000000002,0.54970000000000008,0.67635000000000001,0.86199999999999999]
[null,null,null,null,null,null,null,null,null,null,null,121.3,0.54959999999999998,0.67620000000000002,0.52569999999999995,0.55430000000000001,0.57350000000000001,0.79810000000000003,0.54959999999999998,0.67620000000000002,0.86199999999999999]
[null,null,null,null,null,null,null,null,null,null,null,121.4,0.54949999999999999,0.67610000000000003,0.52559999999999996,0.55420000000000003,0.57340000000000002,0.79800000000000004,0.54949999999999999,0.67610000000000003,0.86199999999999999]
[null,null,null,null,null,null,null,null,null,null,null,121.5,0.5494,0.67600000000000005,0.52549999999999997,0.55410000000000004,0.57330000000000003,0.79790000000000005,0.5494,0.67600000000000005,0.86199999999999999]
[null,null,null,null,null,null,null,null,null,null,null,121.6,0.54930000000000001,0.67584999999999995,0.52539999999999998,0.55389999999999995,0.57320000000000004,0.79779999999999995,0.54930000000000001,0.67584999999999995,0.86160000000000003]
[null,null,null,null,null,null,null,null,null,null,null,121.7,0.54920000000000002,0.67574999999999996,0.52529999999999999,0.55379999999999996,0.57310000000000005,0.79769999999999996,0.54920000000000002,0.67574999999999996,0.86119999999999997]
[null,null,null,null,null,null,null,null,null,null,null,121.8,0.54905000000000004,0.67559999999999998,0.52510000000000001,0.55369999999999997,0.57299999999999995,0.79749999999999999,0.54905000000000004,0.67559999999999998,0.86099999999999999]
[null,null,null,null,null,null,null,null,null,null,null,121.9,0.54949999999999999,0.67549999999999999,0.52610000000000001,0.55359999999999998,0.57289999999999996,0.7974,0.54949999999999999,0.67549999999999999,0.86099999999999999]
[null,null,null,null,null,null,null,null,null,null,null,122,0.54885000000000006,0.67535000000000001,0.52490000000000003,0.5534,0.57279999999999998,0.79730000000000001,0.54885000000000006,0.67535000000000001,0.86099999999999999]
[null,null,null,null,null,null,null,null,null,null,null,122.1,0.54874999999999996,0.67525000000000002,0.52480000000000004,0.55330000000000001,0.57269999999999999,0.79720000000000002,0.54874999999999996,0.67525000000000002,0.86099999999999999]
[null,null,null,null,null,null,null,null,null,null,null,122.2,0.54865000000000008,0.67515000000000003,0.52470000000000006,0.55320000000000003,0.5726,0.79710000000000003,0.54865000000000008,0.67515000000000003,0.86099999999999999]
[null,null,null,null,null,null,null,null,null,null,null,122.3,0.54854999999999998,0.67500000000000004,0.52459999999999996,0.55300000000000005,0.57250000000000001,0.79700000000000004,0.54854999999999998,0.67500000000000004,0.86099999999999999]
[null,null,null,null,null,null,null,null,null,null,null,122.4,0.54844999999999999,0.67490000000000006,0.52449999999999997,0.55290000000000006,0.57240000000000002,0.79690000000000005,0.54844999999999999,0.67490000000000006,0.86099999999999999]
[null,null,null,null,null,null,null,null,null,null,null,122.5,0.54830000000000001,0.67474999999999996,0.52429999999999999,0.55279999999999996,0.57230000000000003,0.79669999999999996,0.54830000000000001,0.67474999999999996,0.86099999999999999]
[null,null,null,null,null,null,null,null,null,null,null,122.6,0.54820000000000002,0.67459999999999998,0.5242,0.55259999999999998,0.57220000000000004,0.79659999999999997,0.54820000000000002,0.67459999999999998,0.86060000000000003]
[null,null,null,null,null,null,null,null,null,null,null,122.7,0.54810000000000003,0.67449999999999999,0.52410000000000001,0.55249999999999999,0.57210000000000005,0.79649999999999999,0.54810000000000003,0.67449999999999999,0.86019999999999996]
[null,null,null,null,null,null,null,null,null,null,null,122.8,0.54800000000000004,0.6744,0.52400000000000002,0.5524,0.57199999999999995,0.7964,0.54800000000000004,0.6744,0.86]
[null,null,null,null,null,null,null,null,null,null,null,122.9,0.54844999999999999,0.67425000000000002,0.52500000000000002,0.55220000000000002,0.57189999999999996,0.79630000000000001,0.54844999999999999,0.67425000000000002,0.86]
[null,null,null,null,null,null,null,null,null,null,null,123,0.54774999999999996,0.67415000000000003,0.52370000000000005,0.55210000000000004,0.57179999999999997,0.79620000000000002,0.54774999999999996,0.67415000000000003,0.86]
[null,null,null,null,null,null,null,null,null,null,null,123.1,0.54764999999999997,0.67400000000000004,0.52359999999999995,0.55200000000000005,0.57169999999999999,0.79600000000000004,0.54764999999999997,0.67400000000000004,0.86]
[null,null,null,null,null,null,null,null,null,null,null,123.2,0.54754999999999998,0.67390000000000005,0.52349999999999997,0.55190000000000006,0.5716,0.79590000000000005,0.54754999999999998,0.67390000000000005,0.86]
[null,null,null,null,null,null,null,null,null,null,null,123.3,0.54744999999999999,0.67374999999999996,0.52339999999999998,0.55169999999999997,0.57150000000000001,0.79579999999999995,0.54744999999999999,0.67374999999999996,0.86]
[null,null,null,null,null,null,null,null,null,null,null,123.4,0.54730000000000001,0.67364999999999997,0.5232,0.55159999999999998,0.57140000000000002,0.79569999999999996,0.54730000000000001,0.67364999999999997,0.86]
[null,null,null,null,null,null,null,null,null,null,null,123.5,0.54720000000000002,0.67354999999999998,0.52310000000000001,0.55149999999999999,0.57130000000000003,0.79559999999999997,0.54720000000000002,0.67354999999999998,0.86]
[null,null,null,null,null,null,null,null,null,null,null,123.6,0.54710000000000003,0.6734,0.52300000000000002,0.55130000000000001,0.57120000000000004,0.79549999999999998,0.54710000000000003,0.6734,0.85960000000000003]
[null,null,null,null,null,null,null,null,null,null,null,123.7,0.54695000000000005,0.67330000000000001,0.52280000000000004,0.55120000000000002,0.57110000000000005,0.7954,0.54695000000000005,0.67330000000000001,0.85919999999999996]
[null,null,null,null,null,null,null,null,null,null,null,123.8,0.54685000000000006,0.67320000000000002,0.52270000000000005,0.55110000000000003,0.57099999999999995,0.79530000000000001,0.54685000000000006,0.67320000000000002,0.85899999999999999]
[null,null,null,null,null,null,null,null,null,null,null,123.9,0.5474,0.67300000000000004,0.52390000000000003,0.55090000000000006,0.57089999999999996,0.79510000000000003,0.5474,0.67300000000000004,0.85899999999999999]
[null,null,null,null,null,null,null,null,null,null,null,124,0.54659999999999997,0.67290000000000005,0.52239999999999998,0.55080000000000007,0.57079999999999997,0.79500000000000004,0.54659999999999997,0.67290000000000005,0.85899999999999999]
[null,null,null,null,null,null,null,null,null,null,null,124.1,0.54649999999999999,0.67279999999999995,0.52229999999999999,0.55069999999999986,0.57069999999999999,0.79490000000000005,0.54649999999999999,0.67279999999999995,0.85899999999999999]
[null,null,null,null,null,null,null,null,null,null,null,124.2,0.54635,0.67269999999999996,0.52210000000000001,0.55059999999999998,0.5706,0.79479999999999995,0.54635,0.67269999999999996,0.85899999999999999]
[null,null,null,null,null,null,null,null,null,null,null,124.3,0.54625000000000001,0.67254999999999998,0.52200000000000002,0.5504,0.57050000000000001,0.79469999999999996,0.54625000000000001,0.67254999999999998,0.85880000000000001]
[null,null,null,null,null,null,null,null,null,null,null,124.4,0.54615000000000002,0.67244999999999999,0.52190000000000003,0.55030000000000001,0.57040000000000002,0.79459999999999997,0.54615000000000002,0.67244999999999999,0.85839999999999994]
[null,null,null,null,null,null,null,null,null,null,null,124.5,0.54600000000000004,0.67235,0.52170000000000005,0.55020000000000002,0.57030000000000003,0.79449999999999998,0.54600000000000004,0.67235,0.85799999999999998]
[null,null,null,null,null,null,null,null,null,null,null,124.6,0.54590000000000005,0.67215000000000003,0.52159999999999995,0.55000000000000004,0.57020000000000004,0.79430000000000001,0.54590000000000005,0.67215000000000003,0.85799999999999998]
[null,null,null,null,null,null,null,null,null,null,null,124.7,0.54574999999999996,0.67205000000000004,0.52139999999999997,0.54990000000000006,0.57010000000000005,0.79420000000000002,0.54574999999999996,0.67205000000000004,0.85799999999999998]
[null,null,null,null,null,null,null,null,null,null,null,124.8,0.54564999999999997,0.67195000000000005,0.52129999999999999,0.54980000000000007,0.56999999999999995,0.79410000000000003,0.54564999999999997,0.67195000000000005,0.85799999999999998]
[null,null,null,null,null,null,null,null,null,null,null,124.9,0.54625000000000001,0.67179999999999995,0.52259999999999995,0.54959999999999987,0.56989999999999996,0.79400000000000004,0.54625000000000001,0.67179999999999995,0.85799999999999998]
[null,null,null,null,null,null,null,null,null,null,null,125,0.5454,0.67169999999999996,0.52100000000000002,0.54949999999999988,0.56979999999999997,0.79390000000000005,0.5454,0.67169999999999996,0.85799999999999998]
[null,null,null,null,null,null,null,null,null,null,null,125.1,0.54535,0.67159999999999997,0.52090000000000003,0.5494,0.56979999999999997,0.79379999999999995,0.54535,0.67159999999999997,0.85760000000000003]
[null,null,null,null,null,null,null,null,null,null,null,125.2,0.54525000000000001,0.67149999999999999,0.52080000000000004,0.54930000000000001,0.56969999999999998,0.79369999999999996,0.54525000000000001,0.67149999999999999,0.85719999999999996]
[null,null,null,null,null,null,null,null,null,null,null,125.3,0.54509999999999992,0.67135,0.52059999999999995,0.54910000000000003,0.5696,0.79359999999999997,0.54509999999999992,0.67135,0.85699999999999998]
[null,null,null,null,null,null,null,null,null,null,null,125.4,0.54500000000000004,0.67120000000000002,0.52049999999999996,0.54900000000000004,0.56950000000000001,0.79339999999999999,0.54500000000000004,0.67120000000000002,0.85699999999999998]
[null,null,null,null,null,null,null,null,null,null,null,125.5,0.54489999999999994,0.67110000000000003,0.52039999999999997,0.54890000000000005,0.56940000000000002,0.79330000000000001,0.54489999999999994,0.67110000000000003,0.85699999999999998]
[null,null,null,null,null,null,null,null,null,null,null,125.6,0.54479999999999995,0.67095000000000005,0.52029999999999998,0.54870000000000008,0.56930000000000003,0.79320000000000002,0.54479999999999995,0.67095000000000005,0.85699999999999998]
[null,null,null,null,null,null,null,null,null,null,null,125.7,0.54469999999999996,0.67084999999999995,0.5202,0.54859999999999987,0.56920000000000004,0.79310000000000003,0.54469999999999996,0.67084999999999995,0.85699999999999998]
[null,null,null,null,null,null,null,null,null,null,null,125.8,0.54455000000000009,0.67074999999999996,0.52,0.54849999999999988,0.56910000000000005,0.79300000000000004,0.54455000000000009,0.67074999999999996,0.85699999999999998]
[null,null,null,null,null,null,null,null,null,null,null,125.9,{"$error":"#VALUE!"},0.67064999999999997,",5212",0.54839999999999989,0.56899999999999995,0.79290000000000005,{"$error":"#VALUE!"},0.67064999999999997,0.85699999999999998]
[null,null,null,null,null,null,null,null,null,null,null,126,0.54435,0.67049999999999998,0.51980000000000004,0.54820000000000002,0.56889999999999996,0.79279999999999995,0.54435,0.67049999999999998,0.85699999999999998]
[null,null,null,null,null,null,null,null,null,null,null,126.1,0.54425000000000001,0.6704,0.51970000000000005,0.54810000000000003,0.56879999999999997,0.79269999999999996,0.54425000000000001,0.6704,0.85660000000000003]
[null,null,null,null,null,null,null,null,null,null,null,126.2,0.54420000000000002,0.67030000000000001,0.51959999999999995,0.54800000000000004,0.56879999999999997,0.79259999999999997,0.54420000000000002,0.67030000000000001,0.85619999999999996]
[null,null,null,null,null,null,null,null,null,null,null,126.3,0.54404999999999992,0.67010000000000003,0.51939999999999997,0.54780000000000006,0.56869999999999998,0.79239999999999999,0.54404999999999992,0.67010000000000003,0.85599999999999998]
[null,null,null,null,null,null,null,null,null,null,null,126.4,0.54394999999999993,0.67,0.51929999999999998,0.54770000000000008,0.56859999999999999,0.7923,0.54394999999999993,0.67,0.85599999999999998]
[null,null,null,null,null,null,null,null,null,null,null,126.5,0.54384999999999994,0.66990000000000005,0.51919999999999999,0.54760000000000009,0.56850000000000001,0.79220000000000002,0.54384999999999994,0.66990000000000005,0.85599999999999998]
[null,null,null,null,null,null,null,null,null,null,null,126.6,0.54374999999999996,0.66979999999999995,0.51910000000000001,0.54749999999999999,0.56840000000000002,0.79210000000000003,0.54374999999999996,0.66979999999999995,0.85599999999999998]
[null,null,null,null,null,null,null,null,null,null,null,126.7,0.54364999999999997,0.66964999999999997,0.51900000000000002,0.5472999999999999,0.56830000000000003,0.79200000000000004,0.54364999999999997,0.66964999999999997,0.85599999999999998]
[null,null,null,null,null,null,null,null,null,null,null,126.8,0.54350000000000009,0.66954999999999998,0.51880000000000004,0.54719999999999991,0.56820000000000004,0.79190000000000005,0.54350000000000009,0.66954999999999998,0.85580000000000001]
[null,null,null,null,null,null,null,null,null,null,null,126.9,0.54400000000000004,0.66944999999999999,0.51990000000000003,0.54710000000000003,0.56810000000000005,0.79179999999999995,0.54400000000000004,0.66944999999999999,0.85539999999999994]
[null,null,null,null,null,null,null,null,null,null,null,127,0.54335,0.66930000000000001,0.51859999999999995,0.54690000000000005,0.56810000000000005,0.79169999999999996,0.54335,0.66930000000000001,0.85499999999999998]
[null,null,null,null,null,null,null,null,null,null,null,127.1,0.54325000000000001,0.66915000000000002,0.51849999999999996,0.54680000000000006,0.56799999999999995,0.79149999999999998,0.54325000000000001,0.66915000000000002,0.85499999999999998]
[null,null,null,null,null,null,null,null,null,null,null,127.2,0.54315000000000002,0.66905000000000003,0.51839999999999997,0.54670000000000007,0.56789999999999996,0.79139999999999999,0.54315000000000002,0.66905000000000003,0.85499999999999998]
[null,null,null,null,null,null,null,null,null,null,null,127.3,0.54299999999999993,0.66895000000000004,0.51819999999999999,0.54660000000000009,0.56779999999999997,0.7913,0.54299999999999993,0.66895000000000004,0.8548]
[null,null,null,null,null,null,null,null,null,null,null,127.4,0.54289999999999994,0.66879999999999995,0.5181,0.54639999999999989,0.56769999999999998,0.79120000000000001,0.54289999999999994,0.66879999999999995,0.85439999999999994]
[null,null,null,null,null,null,null,null,null,null,null,127.5,0.54279999999999995,0.66869999999999996,0.51800000000000002,0.5462999999999999,0.56759999999999999,0.79110000000000003,0.54279999999999995,0.66869999999999996,0.85399999999999998]
[null,null,null,null,null,null,null,null,null,null,null,127.6,0.54269999999999996,0.66859999999999997,0.51790000000000003,0.54619999999999991,0.5675,0.79100000000000004,0.54269999999999996,0.66859999999999997,0.85399999999999998]
[null,null,null,null,null,null,null,null,null,null,null,127.7,0.54265000000000008,0.66844999999999999,0.51780000000000004,0.54599999999999993,0.5675,0.79090000000000005,0.54265000000000008,0.66844999999999999,0.85399999999999998]
[null,null,null,null,null,null,null,null,null,null,null,127.8,0.54249999999999998,0.66835,0.51759999999999995,0.54590000000000005,0.56740000000000002,0.79079999999999995,0.54249999999999998,0.66835,0.85399999999999998]
[null,null,null,null,null,null,null,null,null,null,null,127.9,0.54300000000000004,0.66825000000000001,0.51870000000000005,0.54580000000000006,0.56730000000000003,0.79069999999999996,0.54300000000000004,0.66825000000000001,0.85399999999999998]
[null,null,null,null,null,null,null,null,null,null,null,128,0.5423,0.66810000000000003,0.51739999999999997,0.54570000000000007,0.56720000000000004,0.79049999999999998,0.5423,0.66810000000000003,0.85399999999999998]
[null,null,null,null,null,null,null,null,null,null,null,128.1,0.54220000000000002,0.66795000000000004,0.51729999999999998,0.5455000000000001,0.56710000000000005,0.79039999999999999,0.54220000000000002,0.66795000000000004,0.85399999999999998]
[null,null,null,null,null,null,null,null,null,null,null,128.19999999999999,0.54210000000000003,0.66785000000000005,0.51719999999999999,0.54540000000000011,0.56699999999999995,0.7903,0.54210000000000003,0.66785000000000005,0.85399999999999998]
[null,null,null,null,null,null,null,null,null,null,null,128.30000000000001,0.54200000000000004,0.66774999999999995,0.51700000000000002,0.5452999999999999,0.56699999999999995,0.79020000000000001,0.54200000000000004,0.66774999999999995,0.8538]
[null,null,null,null,null,null,null,null,null,null,null,128.4,0.54190000000000005,0.66764999999999997,0.51690000000000003,0.54519999999999991,0.56689999999999996,0.79010000000000002,0.54190000000000005,0.66764999999999997,0.85339999999999994]
[null,null,null,null,null,null,null,null,null,null,null,128.5,0.54180000000000006,0.66749999999999998,0.51680000000000004,0.54500000000000004,0.56679999999999997,0.79,0.54180000000000006,0.66749999999999998,0.85299999999999998]
[null,null,null,null,null,null,null,null,null,null,null,128.6,0.54170000000000007,0.66739999999999999,0.51670000000000005,0.54489999999999994,0.56669999999999998,0.78990000000000005,0.54170000000000007,0.66739999999999999,0.85299999999999998]
[null,null,null,null,null,null,null,null,null,null,null,128.69999999999999,0.54159999999999997,0.6673,0.51659999999999995,0.54480000000000006,0.56659999999999999,0.78979999999999995,0.54159999999999997,0.6673,0.85299999999999998]
[null,null,null,null,null,null,null,null,null,null,null,128.80000000000001,0.54144999999999999,0.66715000000000002,0.51639999999999997,0.54460000000000008,0.5665,0.78969999999999996,0.54144999999999999,0.66715000000000002,0.85299999999999998]
[null,null,null,null,null,null,null,null,null,null,null,128.9,0.54200000000000004,0.66700000000000004,0.51749999999999996,0.5445000000000001,0.5665,0.78949999999999998,0.54200000000000004,0.66700000000000004,0.85299999999999998]
[null,null,null,null,null,null,null,null,null,null,null,129,0.5413,0.66690000000000005,0.51619999999999999,0.54440000000000011,0.56640000000000001,0.78939999999999999,0.5413,0.66690000000000005,0.85299999999999998]
[null,null,null,null,null,null,null,null,null,null,null,129.1,0.54120000000000001,0.66679999999999995,0.5161,0.5442999999999999,0.56630000000000003,0.7893,0.54120000000000001,0.66679999999999995,0.85260000000000002]
[null,null,null,null,null,null,null,null,null,null,null,129.19999999999999,0.54110000000000003,0.66664999999999996,0.51600000000000001,0.54409999999999992,0.56620000000000004,0.78920000000000001,0.54110000000000003,0.66664999999999996,0.85219999999999996]
[null,null,null,null,null,null,null,null,null,null,null,129.30000000000001,0.54095000000000004,0.66654999999999998,0.51580000000000004,0.54399999999999993,0.56610000000000005,0.78910000000000002,0.54095000000000004,0.66654999999999998,0.85199999999999998]
[null,null,null,null,null,null,null,null,null,null,null,129.4,0.54090000000000005,0.66644999999999999,0.51570000000000005,0.54389999999999994,0.56610000000000005,0.78900000000000003,0.54090000000000005,0.66644999999999999,0.85199999999999998]
[null,null,null,null,null,null,null,null,null,null,null,129.5,0.54079999999999995,0.66635,0.51559999999999995,0.54379999999999995,0.56599999999999995,0.78890000000000005,0.54079999999999995,0.66635,0.85199999999999998]
[null,null,null,null,null,null,null,null,null,null,null,129.6,0.54069999999999996,0.66620000000000001,0.51549999999999996,0.54360000000000008,0.56589999999999996,0.78879999999999995,0.54069999999999996,0.66620000000000001,0.85199999999999998]
[null,null,null,null,null,null,null,null,null,null,null,129.69999999999999,0.54059999999999997,0.66610000000000003,0.51539999999999997,0.54350000000000009,0.56579999999999997,0.78869999999999996,0.54059999999999997,0.66610000000000003,0.85199999999999998]
[null,null,null,null,null,null,null,null,null,null,null,129.80000000000001,0.54049999999999998,0.66600000000000004,0.51519999999999999,0.54340000000000011,0.56579999999999997,0.78859999999999997,0.54049999999999998,0.66600000000000004,0.8518]
[null,null,null,null,null,null,null,null,null,null,null,129.9,0.54099999999999993,0.66585000000000005,0.51629999999999998,0.54330000000000012,0.56569999999999998,0.78839999999999999,0.54099999999999993,0.66585000000000005,0.85139999999999993]
[null,null,null,null,null,null,null,null,null,null,null,130,0.5403,0.66569999999999996,0.51500000000000001,0.54309999999999992,0.56559999999999999,0.7883,0.5403,0.66569999999999996,0.85099999999999998]
[null,null,null,null,null,null,null,null,null,null,null,130.1,0.54020000000000001,0.66559999999999997,0.51490000000000002,0.54299999999999993,0.5655,0.78820000000000001,0.54020000000000001,0.66559999999999997,0.85099999999999998]
[null,null,null,null,null,null,null,null,null,null,null,130.19999999999999,0.54005000000000003,0.66549999999999998,0.51470000000000005,0.54289999999999994,0.56540000000000001,0.78810000000000002,0.54005000000000003,0.66549999999999998,0.85099999999999998]
[null,null,null,null,null,null,null,null,null,null,null,130.30000000000001,0.54,0.66539999999999999,0.51459999999999995,0.54279999999999995,0.56540000000000001,0.78800000000000003,0.54,0.66539999999999999,0.85099999999999998]
[null,null,null,null,null,null,null,null,null,null,null,130.4,0.53990000000000005,0.66525000000000001,0.51449999999999996,0.54259999999999997,0.56530000000000002,0.78790000000000004,0.53990000000000005,0.66525000000000001,0.85099999999999998]
[null,null,null,null,null,null,null,null,null,null,null,130.5,0.53974999999999995,0.66515000000000002,0.51429999999999998,0.54249999999999998,0.56520000000000004,0.78779999999999994,0.53974999999999995,0.66515000000000002,0.85099999999999998]
[null,null,null,null,null,null,null,null,null,null,null,130.6,0.53964999999999996,0.66505000000000003,0.51419999999999999,0.5424000000000001,0.56510000000000005,0.78769999999999996,0.53964999999999996,0.66505000000000003,0.85099999999999998]
[null,null,null,null,null,null,null,null,null,null,null,130.69999999999999,0.53960000000000008,0.66490000000000005,0.5141,0.54220000000000013,0.56510000000000005,0.78759999999999997,0.53960000000000008,0.66490000000000005,0.85099999999999998]
[null,null,null,null,null,null,null,null,null,null,null,130.80000000000001,0.53949999999999998,0.66479999999999995,0.51400000000000001,0.54209999999999992,0.56499999999999995,0.78749999999999998,0.53949999999999998,0.66479999999999995,0.8508]
[null,null,null,null,null,null,null,null,null,null,null,130.9,0.54,0.66464999999999996,0.5151,0.54199999999999993,0.56489999999999996,0.7873,0.54,0.66464999999999996,0.85039999999999993]
[null,null,null,null,null,null,null,null,null,null,null,131,0.5393,0.66454999999999997,0.51380000000000003,0.54189999999999994,0.56479999999999997,0.78720000000000001,0.5393,0.66454999999999997,0.85]
[null,null,null,null,null,null,null,null,null,null,null,131.1,0.53920000000000001,0.66439999999999999,0.51370000000000005,0.54169999999999996,0.56469999999999998,0.78710000000000002,0.53920000000000001,0.66439999999999999,0.85]
[null,null,null,null,null,null,null,null,null,null,null,131.19999999999999,0.53915000000000002,0.6643,0.51359999999999995,0.54159999999999997,0.56469999999999998,0.78700000000000003,0.53915000000000002,0.6643,0.85]
[null,null,null,null,null,null,null,null,null,null,null,131.30000000000001,0.53899999999999992,0.66420000000000001,0.51339999999999997,0.54149999999999998,0.56459999999999999,0.78690000000000004,0.53899999999999992,0.66420000000000001,0.85]
[null,null,null,null,null,null,null,null,null,null,null,131.4,0.53889999999999993,0.66410000000000002,0.51329999999999998,0.54139999999999999,0.5645,0.78680000000000005,0.53889999999999993,0.66410000000000002,0.85]
[null,null,null,null,null,null,null,null,null,null,null,131.5,0.53879999999999995,0.66395000000000004,0.51319999999999999,0.54120000000000013,0.56440000000000001,0.78669999999999995,0.53879999999999995,0.66395000000000004,0.85]
[null,null,null,null,null,null,null,null,null,null,null,131.6,0.53874999999999995,0.66385000000000005,0.5131,0.54110000000000014,0.56440000000000001,0.78659999999999997,0.53874999999999995,0.66385000000000005,0.84960000000000002]
[null,null,null,null,null,null,null,null,null,null,null,131.69999999999999,0.53865000000000007,0.66374999999999995,0.51300000000000001,0.54099999999999993,0.56430000000000002,0.78649999999999998,0.53865000000000007,0.66374999999999995,0.84919999999999995]
[null,null,null,null,null,null,null,null,null,null,null,131.80000000000001,0.53849999999999998,0.66364999999999996,0.51280000000000003,0.54089999999999994,0.56420000000000003,0.78639999999999999,0.53849999999999998,0.66364999999999996,0.84899999999999998]
[null,null,null,null,null,null,null,null,null,null,null,131.9,0.53905000000000003,0.66344999999999998,0.51390000000000002,0.54069999999999996,0.56420000000000003,0.78620000000000001,0.53905000000000003,0.66344999999999998,0.84899999999999998]
[null,null,null,null,null,null,null,null,null,null,null,132,0.53835,0.66335,0.51259999999999994,0.54059999999999997,0.56410000000000005,0.78610000000000002,0.53835,0.66335,0.84899999999999998]
[null,null,null,null,null,null,null,null,null,null,null,132.1,0.5382499999999999,0.66325000000000001,0.51249999999999996,0.54049999999999998,0.56399999999999995,0.78600000000000003,0.5382499999999999,0.66325000000000001,0.84899999999999998]
[null,null,null,null,null,null,null,null,null,null,null,132.19999999999999,0.53814999999999991,0.66315000000000002,0.51239999999999997,0.54039999999999999,0.56389999999999996,0.78590000000000004,0.53814999999999991,0.66315000000000002,0.84899999999999998]
[null,null,null,null,null,null,null,null,null,null,null,132.30000000000001,0.53804999999999992,0.66300000000000003,0.51219999999999999,0.54020000000000001,0.56389999999999996,0.78580000000000005,0.53804999999999992,0.66300000000000003,0.8488]
[null,null,null,null,null,null,null,null,null,null,null,132.4,0.53794999999999993,0.66290000000000004,0.5121,0.54010000000000014,0.56379999999999997,0.78569999999999995,0.53794999999999993,0.66290000000000004,0.84839999999999993]
[null,null,null,null,null,null,null,null,null,null,null,132.5,0.53784999999999994,0.66279999999999994,0.51200000000000001,0.54,0.56369999999999998,0.78559999999999997,0.53784999999999994,0.66279999999999994,0.84799999999999998]
[null,null,null,null,null,null,null,null,null,null,null,132.6,0.53774999999999995,0.66269999999999996,0.51190000000000002,0.53989999999999994,0.56359999999999999,0.78549999999999998,0.53774999999999995,0.66269999999999996,0.84799999999999998]
[null,null,null,null,null,null,null,null,null,null,null,132.69999999999999,0.53770000000000007,0.66254999999999997,0.51180000000000003,0.53969999999999996,0.56359999999999999,0.78539999999999999,0.53770000000000007,0.66254999999999997,0.84799999999999998]
[null,null,null,null,null,null,null,null,null,null,null,132.80000000000001,0.53754999999999997,0.66244999999999998,0.51160000000000005,0.53959999999999997,0.5635,0.7853,0.53754999999999997,0.66244999999999998,0.84799999999999998]
[null,null,null,null,null,null,null,null,null,null,null,132.9,0.53805000000000003,0.66234999999999999,0.51270000000000004,0.53949999999999998,0.56340000000000001,0.78520000000000001,0.53805000000000003,0.66234999999999999,0.84799999999999998]
[null,null,null,null,null,null,null,null,null,null,null,133,0.53739999999999999,0.66220000000000001,0.51139999999999997,0.53939999999999999,0.56340000000000001,0.78500000000000003,0.53739999999999999,0.66220000000000001,0.84799999999999998]
[null,null,null,null,null,null,null,null,null,null,null,133.1,0.5373,0.66205000000000003,0.51129999999999998,0.53920000000000001,0.56330000000000002,0.78490000000000004,0.5373,0.66205000000000003,0.84799999999999998]
[null,null,null,null,null,null,null,null,null,null,null,133.19999999999999,0.53720000000000001,0.66195000000000004,0.51119999999999999,0.53910000000000002,0.56320000000000003,0.78480000000000005,0.53720000000000001,0.66195000000000004,0.84799999999999998]
[null,null,null,null,null,null,null,null,null,null,null,133.30000000000001,0.53705000000000003,0.68184999999999996,0.51100000000000001,0.57899999999999996,0.56310000000000004,0.78469999999999995,0.53705000000000003,0.68184999999999996,0.8478]
[null,null,null,null,null,null,null,null,null,null,null,133.4,0.53700000000000003,0.66174999999999995,0.51090000000000002,0.53889999999999993,0.56310000000000004,0.78459999999999996,0.53700000000000003,0.66174999999999995,0.84739999999999993]
[null,null,null,null,null,null,null,null,null,null,null,133.5,0.53689999999999993,0.66159999999999997,0.51080000000000003,0.53869999999999996,0.56299999999999994,0.78449999999999998,0.53689999999999993,0.66159999999999997,0.84699999999999998]
[null,null,null,null,null,null,null,null,null,null,null,133.6,0.53679999999999994,0.66149999999999998,0.51070000000000004,0.53859999999999997,0.56289999999999996,0.78439999999999999,0.53679999999999994,0.66149999999999998,0.84699999999999998]
[null,null,null,null,null,null,null,null,null,null,null,133.69999999999999,0.53675000000000006,0.66139999999999999,0.51060000000000005,0.53849999999999998,0.56289999999999996,0.7843,0.53675000000000006,0.66139999999999999,0.84699999999999998]
[null,null,null,null,null,null,null,null,null,null,null,133.80000000000001,0.53659999999999997,0.6613,0.51039999999999996,0.53839999999999999,0.56279999999999997,0.78420000000000001,0.53659999999999997,0.6613,0.84699999999999998]
[null,null,null,null,null,null,null,null,null,null,null,133.9,0.53709999999999991,0.66115000000000002,0.51149999999999995,0.53820000000000001,0.56269999999999998,0.78410000000000002,0.53709999999999991,0.66115000000000002,0.84699999999999998]
[null,null,null,null,null,null,null,null,null,null,null,134,0.53644999999999998,0.66105000000000003,0.51019999999999999,0.53810000000000002,0.56269999999999998,0.78400000000000003,0.53644999999999998,0.66105000000000003,0.84699999999999998]
[null,null,null,null,null,null,null,null,null,null,null,134.1,0.53634999999999999,0.66090000000000004,0.5101,0.53800000000000003,0.56259999999999999,0.78380000000000005,0.53634999999999999,0.66090000000000004,0.84699999999999998]
[null,null,null,null,null,null,null,null,null,null,null,134.19999999999999,0.53625,0.66080000000000005,0.51,0.53790000000000016,0.5625,0.78369999999999995,0.53625,0.66080000000000005,0.84699999999999998]
[null,null,null,null,null,null,null,null,null,null,null,134.30000000000001,0.53610000000000002,0.66069999999999995,0.50980000000000003,0.53779999999999994,0.56240000000000001,0.78359999999999996,0.53610000000000002,0.66069999999999995,0.84699999999999998]
[null,null,null,null,null,null,null,null,null,null,null,134.4,0.53605000000000003,0.66054999999999997,0.50970000000000004,0.53759999999999997,0.56240000000000001,0.78349999999999997,0.53605000000000003,0.66054999999999997,0.84699999999999998]
[null,null,null,null,null,null,null,null,null,null,null,134.5,0.53595000000000004,0.66044999999999998,0.50960000000000005,0.53749999999999998,0.56230000000000002,0.78339999999999999,0.53595000000000004,0.66044999999999998,0.84699999999999998]
[null,null,null,null,null,null,null,null,null,null,null,134.6,0.53584999999999994,0.66034999999999999,0.50949999999999995,0.53739999999999999,0.56220000000000003,0.7833,0.53584999999999994,0.66034999999999999,0.84660000000000002]
[null,null,null,null,null,null,null,null,null,null,null,134.69999999999999,0.53580000000000005,0.66025,0.50939999999999996,0.5373,0.56220000000000003,0.78320000000000001,0.53580000000000005,0.66025,0.84619999999999995]
[null,null,null,null,null,null,null,null,null,null,null,134.80000000000001,0.53564999999999996,0.66010000000000002,0.50919999999999999,0.53710000000000002,0.56210000000000004,0.78310000000000002,0.53564999999999996,0.66010000000000002,0.84599999999999997]
[null,null,null,null,null,null,null,null,null,null,null,134.9,0.53615000000000002,0.66,0.51029999999999998,0.53700000000000003,0.56200000000000006,0.78300000000000003,0.53615000000000002,0.66,0.84599999999999997]
[null,null,null,null,null,null,null,null,null,null,null,135,0.53550000000000009,0.65990000000000004,0.50900000000000001,0.53690000000000004,0.56200000000000006,0.78290000000000004,0.53550000000000009,0.65990000000000004,0.84599999999999997]
[null,null,null,null,null,null,null,null,null,null,null,135.1,0.53539999999999999,0.65980000000000005,0.50890000000000002,0.53680000000000005,0.56189999999999996,0.78280000000000005,0.53539999999999999,0.65980000000000005,0.84599999999999997]
[null,null,null,null,null,null,null,null,null,null,null,135.19999999999999,0.5353,0.65964999999999996,0.50880000000000003,0.53659999999999997,0.56179999999999997,0.78269999999999995,0.5353,0.65964999999999996,0.84599999999999997]
[null,null,null,null,null,null,null,null,null,null,null,135.30000000000001,0.53520000000000001,0.65949999999999998,0.50860000000000005,0.53649999999999998,0.56179999999999997,0.78249999999999997,0.53520000000000001,0.65949999999999998,0.8458]
[null,null,null,null,null,null,null,null,null,null,null,135.4,0.53509999999999991,0.65939999999999999,0.50849999999999995,0.53639999999999999,0.56169999999999998,0.78239999999999998,0.53509999999999991,0.65939999999999999,0.84539999999999993]
[null,null,null,null,null,null,null,null,null,null,null,135.5,0.53500000000000003,0.6593,0.50839999999999996,0.5363,0.56159999999999999,0.7823,0.53500000000000003,0.6593,0.84499999999999997]
[null,null,null,null,null,null,null,null,null,null,null,135.6,0.53495000000000004,0.65915000000000001,0.50829999999999997,0.53610000000000002,0.56159999999999999,0.78220000000000001,0.53495000000000004,0.65915000000000001,0.84499999999999997]
[null,null,null,null,null,null,null,null,null,null,null,135.69999999999999,0.53485000000000005,0.65905000000000002,0.50819999999999999,0.53600000000000003,0.5615,0.78210000000000002,0.53485000000000005,0.65905000000000002,0.84499999999999997]
[null,null,null,null,null,null,null,null,null,null,null,135.80000000000001,0.53469999999999995,0.65895000000000004,0.50800000000000001,0.53590000000000004,0.56140000000000001,0.78200000000000003,0.53469999999999995,0.65895000000000004,0.84499999999999997]
[null,null,null,null,null,null,null,null,null,null,null,135.9,0.53525,0.65885000000000005,0.5091,0.53580000000000005,0.56140000000000001,0.78190000000000004,0.53525,0.65885000000000005,0.84499999999999997]
[null,null,null,null,null,null,null,null,null,null,null,136,0.53455000000000008,0.65874999999999995,0.50780000000000003,0.53569999999999984,0.56130000000000002,0.78180000000000005,0.53455000000000008,0.65874999999999995,0.84499999999999997]
[null,null,null,null,null,null,null,null,null,null,null,136.1,0.53445000000000009,0.65859999999999996,0.50770000000000004,0.53549999999999998,0.56120000000000003,0.78169999999999995,0.53445000000000009,0.65859999999999996,0.84499999999999997]
[null,null,null,null,null,null,null,null,null,null,null,136.19999999999999,0.53439999999999999,0.65849999999999997,0.50760000000000005,0.53539999999999999,0.56120000000000003,0.78159999999999996,0.53439999999999999,0.65849999999999997,0.84499999999999997]
[null,null,null,null,null,null,null,null,null,null,null,136.30000000000001,0.5343,0.65839999999999999,0.50749999999999995,0.5353,0.56110000000000004,0.78149999999999997,0.5343,0.65839999999999999,0.8448]
[null,null,null,null,null,null,null,null,null,null,null,136.4,0.53415000000000001,0.6583,0.50729999999999997,0.53520000000000001,0.56100000000000005,0.78139999999999998,0.53415000000000001,0.6583,0.84439999999999993]
[null,null,null,null,null,null,null,null,null,null,null,136.5,0.53410000000000002,0.65815000000000001,0.50719999999999998,0.53500000000000003,0.56100000000000005,0.78129999999999999,0.53410000000000002,0.65815000000000001,0.84399999999999997]
[null,null,null,null,null,null,null,null,null,null,null,136.6,0.53400000000000003,0.65805000000000002,0.5071,0.53490000000000004,0.56089999999999995,0.78120000000000001,0.53400000000000003,0.65805000000000002,0.84399999999999997]
[null,null,null,null,null,null,null,null,null,null,null,136.69999999999999,0.53394999999999992,0.65795000000000003,0.50700000000000001,0.53480000000000005,0.56089999999999995,0.78110000000000002,0.53394999999999992,0.65795000000000003,0.84399999999999997]
[null,null,null,null,null,null,null,null,null,null,null,136.80000000000001,0.53384999999999994,0.65780000000000005,0.50690000000000002,0.53470000000000006,0.56079999999999997,0.78090000000000004,0.53384999999999994,0.65780000000000005,0.84399999999999997]
[null,null,null,null,null,null,null,null,null,null,null,136.9,0.5343,0.65769999999999995,0.50790000000000002,0.53459999999999985,0.56069999999999998,0.78080000000000005,0.5343,0.65769999999999995,0.84399999999999997]
[null,null,null,null,null,null,null,null,null,null,null,137,0.53370000000000006,0.65754999999999997,0.50670000000000004,0.53439999999999999,0.56069999999999998,0.78069999999999995,0.53370000000000006,0.65754999999999997,0.84399999999999997]
[null,null,null,null,null,null,null,null,null,null,null,137.1,0.53360000000000007,0.65744999999999998,0.50660000000000005,0.5343,0.56059999999999999,0.78059999999999996,0.53360000000000007,0.65744999999999998,0.84360000000000002]
[null,null,null,null,null,null,null,null,null,null,null,137.19999999999999,0.53349999999999997,0.65734999999999999,0.50649999999999995,0.53420000000000001,0.5605,0.78049999999999997,0.53349999999999997,0.65734999999999999,0.84319999999999995]
[null,null,null,null,null,null,null,null,null,null,null,137.30000000000001,0.53344999999999998,0.65725,0.50639999999999996,0.53410000000000002,0.5605,0.78039999999999998,0.53344999999999998,0.65725,0.84299999999999997]
[null,null,null,null,null,null,null,null,null,null,null,137.4,0.5333,0.65710000000000002,0.50619999999999998,0.53390000000000004,0.56040000000000001,0.78029999999999999,0.5333,0.65710000000000002,0.84299999999999997]
[null,null,null,null,null,null,null,null,null,null,null,137.5,0.53320000000000001,0.65700000000000003,0.50609999999999999,0.53380000000000005,0.56030000000000002,0.7802,0.53320000000000001,0.65700000000000003,0.84299999999999997]
[null,null,null,null,null,null,null,null,null,null,null,137.6,0.53315000000000001,0.65690000000000004,0.50600000000000001,0.53370000000000006,0.56030000000000002,0.78010000000000002,0.53315000000000001,0.65690000000000004,0.84299999999999997]
[null,null,null,null,null,null,null,null,null,null,null,137.69999999999999,0.53305000000000002,0.65680000000000005,0.50590000000000002,0.53360000000000007,0.56020000000000003,0.78,0.53305000000000002,0.65680000000000005,0.84299999999999997]
[null,null,null,null,null,null,null,null,null,null,null,137.80000000000001,0.53300000000000003,0.65669999999999995,0.50580000000000003,0.53349999999999986,0.56020000000000003,0.77990000000000004,0.53300000000000003,0.65669999999999995,0.84279999999999999]
[null,null,null,null,null,null,null,null,null,null,null,137.9,0.53344999999999998,0.65654999999999997,0.50680000000000003,0.53329999999999989,0.56010000000000004,0.77980000000000005,0.53344999999999998,0.65654999999999997,0.84239999999999993]
[null,null,null,null,null,null,null,null,null,null,null,138,0.53280000000000005,0.65644999999999998,0.50560000000000005,0.53320000000000001,0.56000000000000005,0.77969999999999995,0.53280000000000005,0.65644999999999998,0.84199999999999997]
[null,null,null,null,null,null,null,null,null,null,null,138.1,0.53275000000000006,0.65634999999999999,0.50549999999999995,0.53310000000000002,0.56000000000000005,0.77959999999999996,0.53275000000000006,0.65634999999999999,0.84199999999999997]
[null,null,null,null,null,null,null,null,null,null,null,138.19999999999999,0.53264999999999996,0.65625,0.50539999999999996,0.53300000000000003,0.55989999999999995,0.77949999999999997,0.53264999999999996,0.65625,0.84199999999999997]
[null,null,null,null,null,null,null,null,null,null,null,138.30000000000001,0.53254999999999997,0.65610000000000002,0.50529999999999997,0.53280000000000005,0.55979999999999996,0.77939999999999998,0.53254999999999997,0.65610000000000002,0.84199999999999997]
[null,null,null,null,null,null,null,null,null,null,null,138.4,0.53244999999999998,0.65600000000000003,0.50509999999999999,0.53270000000000006,0.55979999999999996,0.77929999999999999,0.53244999999999998,0.65600000000000003,0.84199999999999997]
[null,null,null,null,null,null,null,null,null,null,null,138.5,0.53234999999999999,0.65590000000000004,0.505,0.53260000000000007,0.55969999999999998,0.7792,0.53234999999999999,0.65590000000000004,0.84199999999999997]
[null,null,null,null,null,null,null,null,null,null,null,138.6,0.5323,0.65580000000000005,0.50490000000000002,0.53249999999999997,0.55969999999999998,0.77910000000000001,0.5323,0.65580000000000005,0.84199999999999997]
[null,null,null,null,null,null,null,null,null,null,null,138.69999999999999,0.53220000000000001,0.65569999999999995,0.50480000000000003,0.53239999999999987,0.55959999999999999,0.77900000000000003,0.53220000000000001,0.65569999999999995,0.84199999999999997]
[null,null,null,null,null,null,null,null,null,null,null,138.80000000000001,0.53210000000000002,0.65554999999999997,0.50470000000000004,0.5321999999999999,0.5595,0.77890000000000004,0.53210000000000002,0.65554999999999997,0.84179999999999999]
[null,null,null,null,null,null,null,null,null,null,null,138.9,0.53259999999999996,0.65539999999999998,0.50570000000000004,0.53210000000000002,0.5595,0.77869999999999995,0.53259999999999996,0.65539999999999998,0.84139999999999993]
[null,null,null,null,null,null,null,null,null,null,null,139,0.53194999999999992,0.65529999999999999,0.50449999999999995,0.53200000000000003,0.55940000000000001,0.77859999999999996,0.53194999999999992,0.65529999999999999,0.84099999999999997]
[null,null,null,null,null,null,null,null,null,null,null,139.1,0.53184999999999993,0.6552,0.50439999999999996,0.53190000000000004,0.55930000000000002,0.77849999999999997,0.53184999999999993,0.6552,0.84099999999999997]
[null,null,null,null,null,null,null,null,null,null,null,139.19999999999999,0.53180000000000005,0.65510000000000002,0.50429999999999997,0.53180000000000005,0.55930000000000002,0.77839999999999998,0.53180000000000005,0.65510000000000002,0.84099999999999997]
[null,null,null,null,null,null,null,null,null,null,null,139.30000000000001,0.53170000000000006,0.65495000000000003,0.50419999999999998,0.53160000000000007,0.55920000000000003,0.77829999999999999,0.53170000000000006,0.65495000000000003,0.84099999999999997]
[null,null,null,null,null,null,null,null,null,null,null,139.4,0.53160000000000007,0.65485000000000004,0.504,0.53150000000000008,0.55920000000000003,0.7782,0.53160000000000007,0.65485000000000004,0.84099999999999997]
[null,null,null,null,null,null,null,null,null,null,null,139.5,0.53150000000000008,0.65475000000000005,0.50390000000000001,0.53140000000000009,0.55910000000000004,0.77810000000000001,0.53150000000000008,0.65475000000000005,0.84099999999999997]
[null,null,null,null,null,null,null,null,null,null,null,139.6,0.53140000000000009,0.65464999999999995,0.50380000000000003,0.53129999999999988,0.55900000000000005,0.77800000000000002,0.53140000000000009,0.65464999999999995,0.84060000000000001]
[null,null,null,null,null,null,null,null,null,null,null,139.69999999999999,0.53134999999999999,0.65454999999999997,0.50370000000000004,0.53119999999999989,0.55900000000000005,0.77790000000000004,0.53134999999999999,0.65454999999999997,0.84019999999999995]
[null,null,null,null,null,null,null,null,null,null,null,139.80000000000001,0.53125,0.65439999999999998,0.50360000000000005,0.53099999999999992,0.55889999999999995,0.77780000000000005,0.53125,0.65439999999999998,0.84]
[null,null,null,null,null,null,null,null,null,null,null,139.9,0.53174999999999994,0.65429999999999999,0.50460000000000005,0.53090000000000004,0.55889999999999995,0.77769999999999995,0.53174999999999994,0.65429999999999999,0.84]
[null,null,null,null,null,null,null,null,null,null,null,140,0.53109999999999991,0.6542,0.50339999999999996,0.53080000000000005,0.55879999999999996,0.77759999999999996,0.53109999999999991,0.6542,0.84]
[null,null,null,null,null,null,null,null,null,null,null,140.1,0.53099999999999992,0.65414000000000005,0.50329999999999997,0.53078000000000014,0.55869999999999997,0.77749999999999997,0.53099999999999992,0.65414000000000005,0.84]
[null,null,null,null,null,null,null,null,null,null,null,140.19999999999999,0.53095000000000003,0.65403999999999995,0.50319999999999998,0.53067999999999993,0.55869999999999997,0.77739999999999998,0.53095000000000003,0.65403999999999995,0.84]
[null,null,null,null,null,null,null,null,null,null,null,140.30000000000001,0.53085000000000004,0.65393000000000001,0.50309999999999999,0.53056000000000003,0.55859999999999999,0.77729999999999999,0.53085000000000004,0.65393000000000001,0.84]
[null,null,null,null,null,null,null,null,null,null,null,140.4,0.53075000000000006,0.65383000000000002,0.50290000000000001,0.53046000000000004,0.55859999999999999,0.7772,0.53075000000000006,0.65383000000000002,0.84]
[null,null,null,null,null,null,null,null,null,null,null,140.5,0.53065000000000007,0.65371999999999997,0.50280000000000002,0.53033999999999992,0.5585,0.77710000000000001,0.53065000000000007,0.65371999999999997,0.84]
[null,null,null,null,null,null,null,null,null,null,null,140.6,0.53059999999999996,0.65361999999999998,0.50270000000000004,0.53023999999999993,0.5585,0.77700000000000002,0.53059999999999996,0.65361999999999998,0.84]
[null,null,null,null,null,null,null,null,null,null,null,140.69999999999999,0.53049999999999997,0.65351000000000004,0.50260000000000005,0.53012000000000004,0.55840000000000001,0.77690000000000003,0.53049999999999997,0.65351000000000004,0.84]
[null,null,null,null,null,null,null,null,null,null,null,140.80000000000001,0.53039999999999998,0.65341000000000005,0.50249999999999995,0.53002000000000005,0.55830000000000002,0.77680000000000005,0.53039999999999998,0.65341000000000005,0.83979999999999999]
[null,null,null,null,null,null,null,null,null,null,null,140.9,0.53089999999999993,0.65329999999999999,0.50349999999999995,0.52990000000000004,0.55830000000000002,0.77669999999999995,0.53089999999999993,0.65329999999999999,0.83939999999999992]
[null,null,null,null,null,null,null,null,null,null,null,141,0.53025,0.6532,0.50229999999999997,0.52980000000000005,0.55820000000000003,0.77659999999999996,0.53025,0.6532,0.83899999999999997]
[null,null,null,null,null,null,null,null,null,null,null,141.1,0.5302,0.65308999999999995,0.50219999999999998,0.52967999999999993,0.55820000000000003,0.77649999999999997,0.5302,0.65308999999999995,0.83899999999999997]
[null,null,null,null,null,null,null,null,null,null,null,141.19999999999999,0.53010000000000002,0.65298999999999996,0.50209999999999999,0.52957999999999994,0.55810000000000004,0.77639999999999998,0.53010000000000002,0.65298999999999996,0.83899999999999997]
[null,null,null,null,null,null,null,null,null,null,null,141.30000000000001,0.53,0.65288000000000002,0.502,0.52946000000000004,0.55800000000000005,0.77629999999999999,0.53,0.65288000000000002,0.83899999999999997]
[null,null,null,null,null,null,null,null,null,null,null,141.4,0.52990000000000004,0.65278000000000003,0.50180000000000002,0.52936000000000005,0.55800000000000005,0.7762,0.52990000000000004,0.65278000000000003,0.83899999999999997]
[null,null,null,null,null,null,null,null,null,null,null,141.5,0.52980000000000005,0.65266999999999997,0.50170000000000003,0.52923999999999993,0.55789999999999995,0.77610000000000001,0.52980000000000005,0.65266999999999997,0.83899999999999997]
[null,null,null,null,null,null,null,null,null,null,null,141.6,0.52974999999999994,0.65256999999999998,0.50160000000000005,0.52913999999999994,0.55789999999999995,0.77600000000000002,0.52974999999999994,0.65256999999999998,0.83899999999999997]
[null,null,null,null,null,null,null,null,null,null,null,141.69999999999999,0.52964999999999995,0.65246000000000004,0.50149999999999995,0.52902000000000005,0.55779999999999996,0.77590000000000003,0.52964999999999995,0.65246000000000004,0.83899999999999997]
[null,null,null,null,null,null,null,null,null,null,null,141.80000000000001,0.52959999999999996,0.65241000000000005,0.50139999999999996,0.52892000000000006,0.55779999999999996,0.77590000000000003,0.52959999999999996,0.65241000000000005,0.83879999999999999]
[null,null,null,null,null,null,null,null,null,null,null,141.9,0.53004999999999991,0.65229999999999999,0.50239999999999996,0.52879999999999994,0.55769999999999997,0.77580000000000005,0.53004999999999991,0.65229999999999999,0.83839999999999992]
[null,null,null,null,null,null,null,null,null,null,null,142,0.52939999999999998,0.6522,0.50119999999999998,0.52870000000000006,0.55759999999999998,0.77569999999999995,0.52939999999999998,0.6522,0.83799999999999997]
[null,null,null,null,null,null,null,null,null,null,null,142.1,0.52934999999999999,0.65208999999999995,0.50109999999999999,0.52857999999999994,0.55759999999999998,0.77559999999999996,0.52934999999999999,0.65208999999999995,0.83799999999999997]
[null,null,null,null,null,null,null,null,null,null,null,142.19999999999999,0.52929999999999999,0.65198999999999996,0.50109999999999999,0.52847999999999995,0.5575,0.77549999999999997,0.52929999999999999,0.65198999999999996,0.83799999999999997]
[null,null,null,null,null,null,null,null,null,null,null,142.30000000000001,0.5292,0.65188000000000001,0.50090000000000001,0.52836000000000005,0.5575,0.77539999999999998,0.5292,0.65188000000000001,0.83799999999999997]
[null,null,null,null,null,null,null,null,null,null,null,142.4,0.52905000000000002,0.65178999999999998,0.50070000000000003,0.52827999999999997,0.55740000000000001,0.77529999999999999,0.52905000000000002,0.65178999999999998,0.83799999999999997]
[null,null,null,null,null,null,null,null,null,null,null,142.5,0.52895000000000003,0.65168000000000004,0.50060000000000004,0.52816000000000007,0.55730000000000002,0.7752,0.52895000000000003,0.65168000000000004,0.83799999999999997]
[null,null,null,null,null,null,null,null,null,null,null,142.6,0.52889999999999993,0.65158000000000005,0.50049999999999994,0.52806000000000008,0.55730000000000002,0.77510000000000001,0.52889999999999993,0.65158000000000005,0.83799999999999997]
[null,null,null,null,null,null,null,null,null,null,null,142.69999999999999,0.52879999999999994,0.65146999999999999,0.50039999999999996,0.52793999999999996,0.55720000000000003,0.77500000000000002,0.52879999999999994,0.65146999999999999,0.83799999999999997]
[null,null,null,null,null,null,null,null,null,null,null,142.80000000000001,0.52875000000000005,0.65137,0.50029999999999997,0.52783999999999998,0.55720000000000003,0.77490000000000003,0.52875000000000005,0.65137,0.83779999999999999]
[null,null,null,null,null,null,null,null,null,null,null,142.9,0.5292,0.65125999999999995,0.50129999999999997,0.52771999999999986,0.55710000000000004,0.77480000000000004,0.5292,0.65125999999999995,0.83739999999999992]
[null,null,null,null,null,null,null,null,null,null,null,143,0.52859999999999996,0.65115999999999996,0.50009999999999999,0.52761999999999987,0.55710000000000004,0.77470000000000006,0.52859999999999996,0.65115999999999996,0.83699999999999997]
[null,null,null,null,null,null,null,null,null,null,null,143.1,0.52849999999999997,0.65105000000000002,0.5,0.52749999999999997,0.55700000000000005,0.77459999999999996,0.52849999999999997,0.65105000000000002,0.83699999999999997]
[null,null,null,null,null,null,null,null,null,null,null,143.19999999999999,0.52845000000000009,0.65095000000000003,0.49990000000000001,0.52740000000000009,0.55700000000000005,0.77449999999999997,0.52845000000000009,0.65095000000000003,0.83699999999999997]
[null,null,null,null,null,null,null,null,null,null,null,143.30000000000001,0.52834999999999999,0.65083999999999997,0.49980000000000002,0.52727999999999997,0.55689999999999995,0.77439999999999998,0.52834999999999999,0.65083999999999997,0.83699999999999997]
[null,null,null,null,null,null,null,null,null,null,null,143.4,0.52825,0.65076000000000001,0.49969999999999998,0.52712000000000003,0.55679999999999996,0.77439999999999998,0.52825,0.65076000000000001,0.83699999999999997]
[null,null,null,null,null,null,null,null,null,null,null,143.5,0.52815000000000001,0.65068000000000004,0.4995,0.52706000000000008,0.55679999999999996,0.77429999999999999,0.52815000000000001,0.65068000000000004,0.83699999999999997]
[null,null,null,null,null,null,null,null,null,null,null,143.6,0.52805000000000002,0.65058000000000005,0.49940000000000001,0.52696000000000009,0.55669999999999997,0.7742,0.52805000000000002,0.65058000000000005,0.83699999999999997]
[null,null,null,null,null,null,null,null,null,null,null,143.69999999999999,0.52800000000000002,0.65046999999999999,0.49930000000000002,0.52683999999999997,0.55669999999999997,0.77410000000000001,0.52800000000000002,0.65046999999999999,0.83699999999999997]
[null,null,null,null,null,null,null,null,null,null,null,143.80000000000001,0.52790000000000004,0.65037,0.49919999999999998,0.52673999999999999,0.55659999999999998,0.77400000000000002,0.52790000000000004,0.65037,0.83679999999999999]
[null,null,null,null,null,null,null,null,null,null,null,143.9,0.52839999999999998,0.65025999999999995,0.50019999999999998,0.52661999999999987,0.55659999999999998,0.77390000000000003,0.52839999999999998,0.65025999999999995,0.83639999999999992]
[null,null,null,null,null,null,null,null,null,null,null,144,0.52774999999999994,0.65015999999999996,0.499,0.52651999999999988,0.55649999999999999,0.77380000000000004,0.52774999999999994,0.65015999999999996,0.83599999999999997]
[null,null,null,null,null,null,null,null,null,null,null,144.1,0.52770000000000006,0.65005000000000002,0.49890000000000001,0.52639999999999998,0.55649999999999999,0.77370000000000005,0.52770000000000006,0.65005000000000002,0.83599999999999997]
[null,null,null,null,null,null,null,null,null,null,null,144.19999999999999,0.52760000000000007,0.64995000000000003,0.49880000000000002,0.5263000000000001,0.55640000000000001,0.77359999999999995,0.52760000000000007,0.64995000000000003,0.83599999999999997]
[null,null,null,null,null,null,null,null,null,null,null,144.30000000000001,0.52749999999999997,0.64988999999999997,0.49869999999999998,0.52617999999999998,0.55630000000000002,0.77359999999999995,0.52749999999999997,0.64988999999999997,0.83599999999999997]
[null,null,null,null,null,null,null,null,null,null,null,144.4,0.52744999999999997,0.64978999999999998,0.49859999999999999,0.52607999999999999,0.55630000000000002,0.77349999999999997,0.52744999999999997,0.64978999999999998,0.83599999999999997]
[null,null,null,null,null,null,null,null,null,null,null,144.5,0.52734999999999999,0.64968000000000004,0.4985,0.52596000000000009,0.55620000000000003,0.77339999999999998,0.52734999999999999,0.64968000000000004,0.83599999999999997]
[null,null,null,null,null,null,null,null,null,null,null,144.6,0.52725,0.64958000000000005,0.49830000000000002,0.52586000000000011,0.55620000000000003,0.77329999999999999,0.52725,0.64958000000000005,0.83599999999999997]
[null,null,null,null,null,null,null,null,null,null,null,144.69999999999999,0.52715000000000001,0.64946999999999999,0.49819999999999998,0.52573999999999999,0.55610000000000004,0.7732,0.52715000000000001,0.64946999999999999,0.83599999999999997]
[null,null,null,null,null,null,null,null,null,null,null,144.80000000000001,0.52710000000000001,0.64937,0.49809999999999999,0.52564,0.55610000000000004,0.77310000000000001,0.52710000000000001,0.64937,0.83579999999999999]
[null,null,null,null,null,null,null,null,null,null,null,144.9,0.52754999999999996,0.64925999999999995,0.49909999999999999,0.52551999999999988,0.55600000000000005,0.77300000000000002,0.52754999999999996,0.64925999999999995,0.83539999999999992]
[null,null,null,null,null,null,null,null,null,null,null,145,0.52695000000000003,0.64920999999999995,0.49790000000000001,0.52541999999999989,0.55600000000000005,0.77300000000000002,0.52695000000000003,0.64920999999999995,0.83499999999999996]
[null,null,null,null,null,null,null,null,null,null,null,145.1,0.52685000000000004,0.64910999999999996,0.49780000000000002,0.5253199999999999,0.55589999999999995,0.77290000000000003,0.52685000000000004,0.64910999999999996,0.83499999999999996]
[null,null,null,null,null,null,null,null,null,null,null,145.19999999999999,0.52674999999999994,0.64900999999999998,0.49769999999999998,0.52521999999999991,0.55579999999999996,0.77280000000000004,0.52674999999999994,0.64900999999999998,0.83499999999999996]
[null,null,null,null,null,null,null,null,null,null,null,145.30000000000001,0.52669999999999995,0.64890999999999999,0.49759999999999999,0.52511999999999992,0.55579999999999996,0.77270000000000005,0.52669999999999995,0.64890999999999999,0.83499999999999996]
[null,null,null,null,null,null,null,null,null,null,null,145.4,0.52659999999999996,0.64881,0.4975,0.52502000000000004,0.55569999999999997,0.77259999999999995,0.52659999999999996,0.64881,0.83499999999999996]
[null,null,null,null,null,null,null,null,null,null,null,145.5,0.52654999999999996,0.64871000000000001,0.49740000000000001,0.52492000000000005,0.55569999999999997,0.77249999999999996,0.52654999999999996,0.64871000000000001,0.83499999999999996]
[null,null,null,null,null,null,null,null,null,null,null,145.6,0.52644999999999997,0.64866000000000001,0.49730000000000002,0.52482000000000006,0.55559999999999998,0.77249999999999996,0.52644999999999997,0.64866000000000001,0.83499999999999996]
[null,null,null,null,null,null,null,null,null,null,null,145.69999999999999,0.52639999999999998,0.64856000000000003,0.49719999999999998,0.52472000000000008,0.55559999999999998,0.77239999999999998,0.52639999999999998,0.64856000000000003,0.83499999999999996]
[null,null,null,null,null,null,null,null,null,null,null,145.80000000000001,0.52629999999999999,0.64846000000000004,0.49709999999999999,0.52462000000000009,0.55549999999999999,0.77229999999999999,0.52629999999999999,0.64846000000000004,0.83479999999999999]
[null,null,null,null,null,null,null,null,null,null,null,145.9,0.52675000000000005,0.64825999999999995,0.498,0.5243199999999999,0.55549999999999999,0.7722,0.52675000000000005,0.64825999999999995,0.83439999999999992]
[null,null,null,null,null,null,null,null,null,null,null,146,0.52615000000000001,0.64825999999999995,0.49690000000000001,0.52441999999999989,0.5554,0.77210000000000001,0.52615000000000001,0.64825999999999995,0.83399999999999996]
[null,null,null,null,null,null,null,null,null,null,null,146.1,0.52610000000000001,0.64820999999999995,0.49680000000000002,0.5243199999999999,0.5554,0.77210000000000001,0.52610000000000001,0.64820999999999995,0.83399999999999996]
[null,null,null,null,null,null,null,null,null,null,null,146.19999999999999,0.52600000000000002,0.64810999999999996,0.49669999999999997,0.52421999999999991,0.55530000000000002,0.77200000000000002,0.52600000000000002,0.64810999999999996,0.83399999999999996]
[null,null,null,null,null,null,null,null,null,null,null,146.30000000000001,0.52590000000000003,0.64800999999999997,0.49659999999999999,0.52411999999999992,0.55520000000000003,0.77190000000000003,0.52590000000000003,0.64800999999999997,0.83399999999999996]
[null,null,null,null,null,null,null,null,null,null,null,146.4,0.52585000000000004,0.64790999999999999,0.4965,0.52401999999999993,0.55520000000000003,0.77180000000000004,0.52585000000000004,0.64790999999999999,0.83399999999999996]
[null,null,null,null,null,null,null,null,null,null,null,146.5,0.52575000000000005,0.64781,0.49640000000000001,0.52391999999999994,0.55510000000000004,0.77170000000000005,0.52575000000000005,0.64781,0.83399999999999996]
[null,null,null,null,null,null,null,null,null,null,null,146.6,0.52570000000000006,0.64776,0.49630000000000002,0.52381999999999995,0.55510000000000004,0.77170000000000005,0.52570000000000006,0.64776,0.83399999999999996]
[null,null,null,null,null,null,null,null,null,null,null,146.69999999999999,0.52560000000000007,0.64766000000000001,0.49619999999999997,0.52372000000000007,0.55500000000000005,0.77159999999999995,0.52560000000000007,0.64766000000000001,0.83399999999999996]
[null,null,null,null,null,null,null,null,null,null,null,146.80000000000001,0.52554999999999996,0.64756000000000002,0.49609999999999999,0.52362000000000009,0.55500000000000005,0.77149999999999996,0.52554999999999996,0.64756000000000002,0.83379999999999999]
[null,null,null,null,null,null,null,null,null,null,null,146.9,0.52594999999999992,0.64746000000000004,0.497,0.5235200000000001,0.55489999999999995,0.77139999999999997,0.52594999999999992,0.64746000000000004,0.83339999999999992]
[null,null,null,null,null,null,null,null,null,null,null,147,0.52539999999999998,0.64741000000000004,0.49590000000000001,0.52342000000000011,0.55489999999999995,0.77139999999999997,0.52539999999999998,0.64741000000000004,0.83299999999999996]
[null,null,null,null,null,null,null,null,null,null,null,147.1,0.52529999999999999,0.64731000000000005,0.49580000000000002,0.52332000000000012,0.55479999999999996,0.77129999999999999,0.52529999999999999,0.64731000000000005,0.83299999999999996]
[null,null,null,null,null,null,null,null,null,null,null,147.19999999999999,0.52524999999999999,0.64720999999999995,0.49569999999999997,0.52321999999999991,0.55479999999999996,0.7712,0.52524999999999999,0.64720999999999995,0.83299999999999996]
[null,null,null,null,null,null,null,null,null,null,null,147.30000000000001,0.52515000000000001,0.64715999999999996,0.49559999999999998,0.52311999999999992,0.55469999999999997,0.7712,0.52515000000000001,0.64715999999999996,0.83299999999999996]
[null,null,null,null,null,null,null,null,null,null,null,147.4,0.52510000000000001,0.64705999999999997,0.4955,0.52301999999999993,0.55469999999999997,0.77110000000000001,0.52510000000000001,0.64705999999999997,0.83299999999999996]
[null,null,null,null,null,null,null,null,null,null,null,147.5,0.52500000000000002,0.64695999999999998,0.49540000000000001,0.52291999999999994,0.55459999999999998,0.77100000000000002,0.52500000000000002,0.64695999999999998,0.83299999999999996]
[null,null,null,null,null,null,null,null,null,null,null,147.6,0.52495000000000003,0.64685999999999999,0.49530000000000002,0.52281999999999995,0.55459999999999998,0.77090000000000003,0.52495000000000003,0.64685999999999999,0.83299999999999996]
[null,null,null,null,null,null,null,null,null,null,null,147.69999999999999,0.52485000000000004,0.64681,0.49519999999999997,0.52271999999999996,0.55449999999999999,0.77090000000000003,0.52485000000000004,0.64681,0.83299999999999996]
[null,null,null,null,null,null,null,null,null,null,null,147.80000000000001,0.52475000000000005,0.64671000000000001,0.49509999999999998,0.52261999999999997,0.5544,0.77080000000000004,0.52475000000000005,0.64671000000000001,0.83279999999999998]
[null,null,null,null,null,null,null,null,null,null,null,147.9,0.5252,0.64661000000000002,0.496,0.52251999999999998,0.5544,0.77070000000000005,0.5252,0.64661000000000002,0.83239999999999992]
[null,null,null,null,null,null,null,null,null,null,null,148,0.52459999999999996,0.64656000000000002,0.49490000000000001,0.52242,0.55430000000000001,0.77070000000000005,0.52459999999999996,0.64656000000000002,0.83199999999999996]
[null,null,null,null,null,null,null,null,null,null,null,148.1,0.52455000000000007,0.64646000000000003,0.49480000000000002,0.52232000000000012,0.55430000000000001,0.77059999999999995,0.52455000000000007,0.64646000000000003,0.83199999999999996]
[null,null,null,null,null,null,null,null,null,null,null,148.19999999999999,0.52444999999999997,0.64636000000000005,0.49469999999999997,0.52222000000000013,0.55420000000000003,0.77049999999999996,0.52444999999999997,0.64636000000000005,0.83199999999999996]
[null,null,null,null,null,null,null,null,null,null,null,148.30000000000001,0.52439999999999998,0.64631000000000005,0.49459999999999998,0.52212000000000014,0.55420000000000003,0.77049999999999996,0.52439999999999998,0.64631000000000005,0.83199999999999996]
[null,null,null,null,null,null,null,null,null,null,null,148.4,0.52429999999999999,0.64620999999999995,0.4945,0.52201999999999993,0.55410000000000004,0.77039999999999997,0.52429999999999999,0.64620999999999995,0.83199999999999996]
[null,null,null,null,null,null,null,null,null,null,null,148.5,0.52424999999999999,0.64610999999999996,0.49440000000000001,0.52191999999999994,0.55410000000000004,0.77029999999999998,0.52424999999999999,0.64610999999999996,0.83199999999999996]
[null,null,null,null,null,null,null,null,null,null,null,148.6,0.52415,0.64605999999999997,0.49430000000000002,0.52181999999999995,0.55400000000000005,0.77029999999999998,0.52415,0.64605999999999997,0.83199999999999996]
[null,null,null,null,null,null,null,null,null,null,null,148.69999999999999,0.52410000000000001,0.64595999999999998,0.49419999999999997,0.52171999999999996,0.55400000000000005,0.7702,0.52410000000000001,0.64595999999999998,0.83199999999999996]
[null,null,null,null,null,null,null,null,null,null,null,148.80000000000001,0.52400000000000002,0.64590999999999998,0.49409999999999998,0.52161999999999997,0.55389999999999995,0.7702,0.52400000000000002,0.64590999999999998,0.83179999999999998]
[null,null,null,null,null,null,null,null,null,null,null,148.9,0.52444999999999997,0.64581,0.495,0.52151999999999998,0.55389999999999995,0.77010000000000001,0.52444999999999997,0.64581,0.83139999999999992]
[null,null,null,null,null,null,null,null,null,null,null,149,0.52384999999999993,0.64571000000000001,0.49390000000000001,0.52141999999999999,0.55379999999999996,0.77,0.52384999999999993,0.64571000000000001,0.83099999999999996]
[null,null,null,null,null,null,null,null,null,null,null,149.1,0.52380000000000004,0.64566000000000001,0.49380000000000002,0.52132000000000001,0.55379999999999996,0.77,0.52380000000000004,0.64566000000000001,0.83099999999999996]
[null,null,null,null,null,null,null,null,null,null,null,149.19999999999999,0.52370000000000005,0.64556000000000002,0.49370000000000003,0.52122000000000002,0.55369999999999997,0.76990000000000003,0.52370000000000005,0.64556000000000002,0.83099999999999996]
[null,null,null,null,null,null,null,null,null,null,null,149.30000000000001,0.52364999999999995,0.64551000000000003,0.49359999999999998,0.52112000000000003,0.55369999999999997,0.76990000000000003,0.52364999999999995,0.64551000000000003,0.83099999999999996]
[null,null,null,null,null,null,null,null,null,null,null,149.4,0.52354999999999996,0.64541000000000004,0.49349999999999999,0.52102000000000004,0.55359999999999998,0.76980000000000004,0.52354999999999996,0.64541000000000004,0.83099999999999996]
[null,null,null,null,null,null,null,null,null,null,null,149.5,0.52349999999999997,0.64585999999999999,0.49340000000000001,0.52191999999999994,0.55359999999999998,0.76980000000000004,0.52349999999999997,0.64585999999999999,0.83099999999999996]
[null,null,null,null,null,null,null,null,null,null,null,149.6,0.52339999999999998,0.64525999999999994,0.49330000000000002,0.52081999999999984,0.55349999999999999,0.76970000000000005,0.52339999999999998,0.64525999999999994,0.83099999999999996]
[null,null,null,null,null,null,null,null,null,null,null,149.69999999999999,0.52334999999999998,0.64515999999999996,0.49320000000000003,0.52071999999999996,0.55349999999999999,0.76959999999999995,0.52334999999999998,0.64515999999999996,0.83099999999999996]
[null,null,null,null,null,null,null,null,null,null,null,149.80000000000001,0.52324999999999999,0.64510999999999996,0.49309999999999998,0.52061999999999997,0.5534,0.76959999999999995,0.52324999999999999,0.64510999999999996,0.83099999999999996]
[null,null,null,null,null,null,null,null,null,null,null,149.9,0.52364999999999995,0.64500999999999997,0.49399999999999999,0.52051999999999998,0.55330000000000001,0.76949999999999996,0.52364999999999995,0.64500999999999997,0.83099999999999996]
[null,null,null,null,null,null,null,null,null,null,null,150,0.52310000000000001,0.64495999999999998,0.4929,0.52041999999999999,0.55330000000000001,0.76949999999999996,0.52310000000000001,0.64495999999999998,0.83099999999999996]
[null,null,null,null,null,null,null,null,null,null,null,150.1,0.52300000000000002,0.64485999999999999,0.49280000000000002,0.52032,0.55320000000000003,0.76939999999999997,0.52300000000000002,0.64485999999999999,0.8306]
[null,null,null,null,null,null,null,null,null,null,null,150.19999999999999,0.52295000000000003,0.64480999999999999,0.49270000000000003,0.52022000000000002,0.55320000000000003,0.76939999999999997,0.52295000000000003,0.64480999999999999,0.83019999999999994]
[null,null,null,null,null,null,null,null,null,null,null,150.30000000000001,0.52285000000000004,0.64471000000000001,0.49259999999999998,0.52012000000000003,0.55310000000000004,0.76929999999999998,0.52285000000000004,0.64471000000000001,0.83]
[null,null,null,null,null,null,null,null,null,null,null,150.4,0.52280000000000004,0.64466000000000001,0.49249999999999999,0.52002000000000004,0.55310000000000004,0.76929999999999998,0.52280000000000004,0.64466000000000001,0.83]
[null,null,null,null,null,null,null,null,null,null,null,150.5,0.52270000000000005,0.64456000000000002,0.4924,0.51992000000000005,0.55300000000000005,0.76919999999999999,0.52270000000000005,0.64456000000000002,0.83]
[null,null,null,null,null,null,null,null,null,null,null,150.6,0.52265000000000006,0.64451000000000003,0.49230000000000002,0.51982000000000006,0.55300000000000005,0.76919999999999999,0.52265000000000006,0.64451000000000003,0.83]
[null,null,null,null,null,null,null,null,null,null,null,150.69999999999999,0.52254999999999996,0.64441000000000004,0.49220000000000003,0.51972000000000007,0.55289999999999995,0.76910000000000001,0.52254999999999996,0.64441000000000004,0.83]
[null,null,null,null,null,null,null,null,null,null,null,150.80000000000001,0.52249999999999996,0.64436000000000004,0.49209999999999998,0.51962000000000008,0.55289999999999995,0.76910000000000001,0.52249999999999996,0.64436000000000004,0.83]
[null,null,null,null,null,null,null,null,null,null,null,150.9,0.52289999999999992,0.64431000000000005,0.49299999999999999,0.51952000000000009,0.55279999999999996,0.76910000000000001,0.52289999999999992,0.64431000000000005,0.83]
[null,null,null,null,null,null,null,null,null,null,null,151,0.52234999999999998,0.64420999999999995,0.4919,0.51931999999999989,0.55279999999999996,0.76910000000000001,0.52234999999999998,0.64420999999999995,0.83]
[null,null,null,null,null,null,null,null,null,null,null,151.1,0.52224999999999999,0.64412999999999998,0.49180000000000001,0.51915999999999995,0.55269999999999997,0.76910000000000001,0.52224999999999999,0.64412999999999998,0.83]
[null,null,null,null,null,null,null,null,null,null,null,151.19999999999999,0.5222,0.64405999999999997,0.49170000000000003,0.51901999999999993,0.55269999999999997,0.76910000000000001,0.5222,0.64405999999999997,0.83]
[null,null,null,null,null,null,null,null,null,null,null,151.30000000000001,0.52210000000000001,0.64398,0.49159999999999998,0.51885999999999999,0.55259999999999998,0.76910000000000001,0.52210000000000001,0.64398,0.82979999999999998]
[null,null,null,null,null,null,null,null,null,null,null,151.4,0.52205000000000001,0.64390999999999998,0.49149999999999999,0.51871999999999996,0.55259999999999998,0.76910000000000001,0.52205000000000001,0.64390999999999998,0.82939999999999992]
[null,null,null,null,null,null,null,null,null,null,null,151.5,0.52195000000000003,0.64383000000000001,0.4914,0.51856000000000002,0.55249999999999999,0.76910000000000001,0.52195000000000003,0.64383000000000001,0.82899999999999996]
[null,null,null,null,null,null,null,null,null,null,null,151.6,0.52190000000000003,0.64376,0.49130000000000001,0.51841999999999999,0.55249999999999999,0.76910000000000001,0.52190000000000003,0.64376,0.82899999999999996]
[null,null,null,null,null,null,null,null,null,null,null,151.69999999999999,0.52180000000000004,0.64368000000000003,0.49120000000000003,0.51826000000000005,0.5524,0.76910000000000001,0.52180000000000004,0.64368000000000003,0.82899999999999996]
[null,null,null,null,null,null,null,null,null,null,null,151.80000000000001,0.52174999999999994,0.64361000000000002,0.49109999999999998,0.51812000000000002,0.5524,0.76910000000000001,0.52174999999999994,0.64361000000000002,0.82899999999999996]
[null,null,null,null,null,null,null,null,null,null,null,151.9,0.52215,0.64353000000000005,0.49199999999999999,0.51796000000000009,0.55230000000000001,0.76910000000000001,0.52215,0.64353000000000005,0.82899999999999996]
[null,null,null,null,null,null,null,null,null,null,null,152,0.52160000000000006,0.64346000000000003,0.4909,0.51782000000000006,0.55230000000000001,0.76910000000000001,0.52160000000000006,0.64346000000000003,0.82899999999999996]
[null,null,null,null,null,null,null,null,null,null,null,152.1,0.52150000000000007,0.64337999999999995,0.49080000000000001,0.5176599999999999,0.55220000000000002,0.76910000000000001,0.52150000000000007,0.64337999999999995,0.82899999999999996]
[null,null,null,null,null,null,null,null,null,null,null,152.19999999999999,0.52144999999999997,0.64331000000000005,0.49070000000000003,0.51752000000000009,0.55220000000000002,0.76910000000000001,0.52144999999999997,0.64331000000000005,0.82899999999999996]
[null,null,null,null,null,null,null,null,null,null,null,152.30000000000001,0.52134999999999998,0.64322999999999997,0.49059999999999998,0.51735999999999993,0.55210000000000004,0.76910000000000001,0.52134999999999998,0.64322999999999997,0.82899999999999996]
[null,null,null,null,null,null,null,null,null,null,null,152.4,0.52129999999999999,0.64315999999999995,0.49049999999999999,0.5172199999999999,0.55210000000000004,0.76910000000000001,0.52129999999999999,0.64315999999999995,0.82899999999999996]
[null,null,null,null,null,null,null,null,null,null,null,152.5,0.5212,0.64307999999999998,0.4904,0.51705999999999996,0.55200000000000005,0.76910000000000001,0.5212,0.64307999999999998,0.82899999999999996]
[null,null,null,null,null,null,null,null,null,null,null,152.6,0.52115,0.64300999999999997,0.49030000000000001,0.51691999999999994,0.55200000000000005,0.76910000000000001,0.52115,0.64300999999999997,0.8286]
[null,null,null,null,null,null,null,null,null,null,null,152.69999999999999,0.52105000000000001,0.64293,0.49020000000000002,0.51676,0.55189999999999995,0.76910000000000001,0.52105000000000001,0.64293,0.82819999999999994]
[null,null,null,null,null,null,null,null,null,null,null,152.80000000000001,0.52099999999999991,0.64285999999999999,0.49009999999999998,0.51661999999999997,0.55189999999999995,0.76910000000000001,0.52099999999999991,0.64285999999999999,0.82799999999999996]
[null,null,null,null,null,null,null,null,null,null,null,152.9,0.52139999999999997,0.64278000000000002,0.49099999999999999,0.51646000000000003,0.55179999999999996,0.76910000000000001,0.52139999999999997,0.64278000000000002,0.82799999999999996]
[null,null,null,null,null,null,null,null,null,null,null,153,0.52085000000000004,0.64271,0.4899,0.51632,0.55179999999999996,0.76910000000000001,0.52085000000000004,0.64271,0.82799999999999996]
[null,null,null,null,null,null,null,null,null,null,null,153.1,0.52075000000000005,0.64263000000000003,0.48980000000000001,0.51616000000000006,0.55169999999999997,0.76910000000000001,0.52075000000000005,0.64263000000000003,0.82799999999999996]
[null,null,null,null,null,null,null,null,null,null,null,153.19999999999999,0.52069999999999994,0.64256000000000002,0.48970000000000002,0.51602000000000003,0.55169999999999997,0.76910000000000001,0.52069999999999994,0.64256000000000002,0.82799999999999996]
[null,null,null,null,null,null,null,null,null,null,null,153.30000000000001,0.52059999999999995,0.64248000000000005,0.48959999999999998,0.5158600000000001,0.55159999999999998,0.76910000000000001,0.52059999999999995,0.64248000000000005,0.82799999999999996]
[null,null,null,null,null,null,null,null,null,null,null,153.4,0.52049999999999996,0.64241000000000004,0.48949999999999999,0.51572000000000007,0.55149999999999999,0.76910000000000001,0.52049999999999996,0.64241000000000004,0.82799999999999996]
[null,null,null,null,null,null,null,null,null,null,null,153.5,0.52044999999999997,0.64232999999999996,0.4894,0.51555999999999991,0.55149999999999999,0.76910000000000001,0.52044999999999997,0.64232999999999996,0.82799999999999996]
[null,null,null,null,null,null,null,null,null,null,null,153.6,0.52034999999999998,0.64226000000000005,0.48930000000000001,0.5154200000000001,0.5514,0.76910000000000001,0.52034999999999998,0.64226000000000005,0.82799999999999996]
[null,null,null,null,null,null,null,null,null,null,null,153.69999999999999,0.52029999999999998,0.64217999999999997,0.48920000000000002,0.51525999999999994,0.5514,0.76910000000000001,0.52029999999999998,0.64217999999999997,0.82799999999999996]
[null,null,null,null,null,null,null,null,null,null,null,153.80000000000001,0.5202,0.64210999999999996,0.48909999999999998,0.51511999999999991,0.55130000000000001,0.76910000000000001,0.5202,0.64210999999999996,0.82799999999999996]
[null,null,null,null,null,null,null,null,null,null,null,153.9,0.52065000000000006,0.64202999999999999,0.49,0.51495999999999997,0.55130000000000001,0.76910000000000001,0.52065000000000006,0.64202999999999999,0.82799999999999996]
[null,null,null,null,null,null,null,null,null,null,null,154,0.52005000000000001,0.64195999999999998,0.4889,0.51481999999999994,0.55120000000000002,0.76910000000000001,0.52005000000000001,0.64195999999999998,0.82799999999999996]
[null,null,null,null,null,null,null,null,null,null,null,154.1,0.52,0.64188000000000001,0.48880000000000001,0.51466000000000001,0.55120000000000002,0.76910000000000001,0.52,0.64188000000000001,0.8276]
[null,null,null,null,null,null,null,null,null,null,null,154.19999999999999,0.51990000000000003,0.64180999999999999,0.48870000000000002,0.51451999999999998,0.55110000000000003,0.76910000000000001,0.51990000000000003,0.64180999999999999,0.82719999999999994]
[null,null,null,null,null,null,null,null,null,null,null,154.30000000000001,0.51985000000000003,0.64173000000000002,0.48859999999999998,0.51436000000000004,0.55110000000000003,0.76910000000000001,0.51985000000000003,0.64173000000000002,0.82699999999999996]
[null,null,null,null,null,null,null,null,null,null,null,154.4,0.51975000000000005,0.64166000000000001,0.48849999999999999,0.51422000000000001,0.55100000000000005,0.76910000000000001,0.51975000000000005,0.64166000000000001,0.82699999999999996]
[null,null,null,null,null,null,null,null,null,null,null,154.5,0.51970000000000005,0.64158000000000004,0.4884,0.51406000000000007,0.55100000000000005,0.76910000000000001,0.51970000000000005,0.64158000000000004,0.82699999999999996]
[null,null,null,null,null,null,null,null,null,null,null,154.6,0.51959999999999995,0.64151000000000002,0.48830000000000001,0.51392000000000004,0.55089999999999995,0.76910000000000001,0.51959999999999995,0.64151000000000002,0.82699999999999996]
[null,null,null,null,null,null,null,null,null,null,null,154.69999999999999,0.51954999999999996,0.64142999999999994,0.48820000000000002,0.51375999999999988,0.55089999999999995,0.76910000000000001,0.51954999999999996,0.64142999999999994,0.82699999999999996]
[null,null,null,null,null,null,null,null,null,null,null,154.80000000000001,0.51944999999999997,0.64136000000000004,0.48809999999999998,0.51362000000000008,0.55079999999999996,0.76910000000000001,0.51944999999999997,0.64136000000000004,0.82699999999999996]
[null,null,null,null,null,null,null,null,null,null,null,154.9,0.51990000000000003,0.64127999999999996,0.48899999999999999,0.51345999999999992,0.55079999999999996,0.76910000000000001,0.51990000000000003,0.64127999999999996,0.82699999999999996]
[null,null,null,null,null,null,null,null,null,null,null,155,0.51929999999999998,0.64120999999999995,0.4879,0.51331999999999989,0.55069999999999997,0.76910000000000001,0.51929999999999998,0.64120999999999995,0.82699999999999996]
[null,null,null,null,null,null,null,null,null,null,null,155.1,0.51924999999999999,0.64114000000000004,0.48780000000000001,0.51318000000000008,0.55069999999999997,0.76910000000000001,0.51924999999999999,0.64114000000000004,0.82699999999999996]
[null,null,null,null,null,null,null,null,null,null,null,155.19999999999999,0.51915,0.64107000000000003,0.48770000000000002,0.51304000000000005,0.55059999999999998,0.76910000000000001,0.51915,0.64107000000000003,0.82699999999999996]
[null,null,null,null,null,null,null,null,null,null,null,155.30000000000001,0.51910000000000001,0.64100000000000001,0.48759999999999998,0.51290000000000002,0.55059999999999998,0.76910000000000001,0.51910000000000001,0.64100000000000001,0.82699999999999996]
[null,null,null,null,null,null,null,null,null,null,null,155.4,0.51900000000000002,0.64093,0.48749999999999999,0.51275999999999999,0.55049999999999999,0.76910000000000001,0.51900000000000002,0.64093,0.82699999999999996]
[null,null,null,null,null,null,null,null,null,null,null,155.5,0.51895000000000002,0.64085999999999999,0.4874,0.51261999999999996,0.55049999999999999,0.76910000000000001,0.51895000000000002,0.64085999999999999,0.82699999999999996]
[null,null,null,null,null,null,null,null,null,null,null,155.6,0.51890000000000003,0.64078999999999997,0.4874,0.51247999999999994,0.5504,0.76910000000000001,0.51890000000000003,0.64078999999999997,0.8266]
[null,null,null,null,null,null,null,null,null,null,null,155.69999999999999,0.51885000000000003,0.64071,0.48730000000000001,0.51232,0.5504,0.76910000000000001,0.51885000000000003,0.64071,0.82619999999999993]
[null,null,null,null,null,null,null,null,null,null,null,155.80000000000001,0.51875000000000004,0.64065000000000005,0.48720000000000002,0.5122000000000001,0.55030000000000001,0.76910000000000001,0.51875000000000004,0.64065000000000005,0.82599999999999996]
[null,null,null,null,null,null,null,null,null,null,null,155.9,0.51915,0.64058000000000004,0.48799999999999999,0.51206000000000007,0.55030000000000001,0.76910000000000001,0.51915,0.64058000000000004,0.82599999999999996]
[null,null,null,null,null,null,null,null,null,null,null,156,0.51859999999999995,0.64051000000000002,0.48699999999999999,0.51192000000000004,0.55020000000000002,0.76910000000000001,0.51859999999999995,0.64051000000000002,0.82599999999999996]
[null,null,null,null,null,null,null,null,null,null,null,156.1,0.51855000000000007,0.64044000000000001,0.4869,0.51178000000000001,0.55020000000000002,0.76910000000000001,0.51855000000000007,0.64044000000000001,0.82599999999999996]
[null,null,null,null,null,null,null,null,null,null,null,156.19999999999999,0.51845000000000008,0.64036999999999999,0.48680000000000001,0.51163999999999998,0.55010000000000003,0.76910000000000001,0.51845000000000008,0.64036999999999999,0.82599999999999996]
[null,null,null,null,null,null,null,null,null,null,null,156.30000000000001,0.51845000000000008,0.64029999999999998,0.48680000000000001,0.51149999999999995,0.55010000000000003,0.76910000000000001,0.51845000000000008,0.64029999999999998,0.82599999999999996]
[null,null,null,null,null,null,null,null,null,null,null,156.4,0.51835000000000009,0.64022999999999997,0.48670000000000002,0.51135999999999993,0.55000000000000004,0.76910000000000001,0.51835000000000009,0.64022999999999997,0.82599999999999996]
[null,null,null,null,null,null,null,null,null,null,null,156.5,0.51829999999999998,0.64015999999999995,0.48659999999999998,0.5112199999999999,0.55000000000000004,0.76910000000000001,0.51829999999999998,0.64015999999999995,0.82599999999999996]
[null,null,null,null,null,null,null,null,null,null,null,156.6,0.51819999999999999,0.64009000000000005,0.48649999999999999,0.51108000000000009,0.54990000000000006,0.76910000000000001,0.51819999999999999,0.64009000000000005,0.82599999999999996]
[null,null,null,null,null,null,null,null,null,null,null,156.69999999999999,0.51815,0.64002000000000003,0.4864,0.51094000000000006,0.54990000000000006,0.76910000000000001,0.51815,0.64002000000000003,0.82599999999999996]
[null,null,null,null,null,null,null,null,null,null,null,156.80000000000001,0.51805000000000001,0.63995000000000002,0.48630000000000001,0.51080000000000003,0.54979999999999996,0.76910000000000001,0.51805000000000001,0.63995000000000002,0.82599999999999996]
[null,null,null,null,null,null,null,null,null,null,null,156.9,0.51844999999999997,0.63988,0.48709999999999998,0.51066,0.54979999999999996,0.76910000000000001,0.51844999999999997,0.63988,0.82599999999999996]
[null,null,null,null,null,null,null,null,null,null,null,157,0.51790000000000003,0.63980999999999999,0.48609999999999998,0.51051999999999997,0.54969999999999997,0.76910000000000001,0.51790000000000003,0.63980999999999999,0.82599999999999996]
[null,null,null,null,null,null,null,null,null,null,null,157.1,0.51784999999999992,0.63973999999999998,0.48599999999999999,0.51037999999999994,0.54969999999999997,0.76910000000000001,0.51784999999999992,0.63973999999999998,0.8256]
[null,null,null,null,null,null,null,null,null,null,null,157.19999999999999,0.51774999999999993,0.63966999999999996,0.4859,0.51023999999999992,0.54959999999999998,0.76910000000000001,0.51774999999999993,0.63966999999999996,0.82519999999999993]
[null,null,null,null,null,null,null,null,null,null,null,157.30000000000001,0.51774999999999993,0.63959999999999995,0.4859,0.51009999999999989,0.54959999999999998,0.76910000000000001,0.51774999999999993,0.63959999999999995,0.82499999999999996]
[null,null,null,null,null,null,null,null,null,null,null,157.4,0.51764999999999994,0.63953000000000004,0.48580000000000001,0.50996000000000008,0.54949999999999999,0.76910000000000001,0.51764999999999994,0.63953000000000004,0.82499999999999996]
[null,null,null,null,null,null,null,null,null,null,null,157.5,0.51760000000000006,0.63946000000000003,0.48570000000000002,0.50982000000000005,0.54949999999999999,0.76910000000000001,0.51760000000000006,0.63946000000000003,0.82499999999999996]
[null,null,null,null,null,null,null,null,null,null,null,157.6,0.51749999999999996,0.63939000000000001,0.48559999999999998,0.50968000000000002,0.5494,0.76910000000000001,0.51749999999999996,0.63939000000000001,0.82499999999999996]
[null,null,null,null,null,null,null,null,null,null,null,157.69999999999999,0.51744999999999997,0.63932,0.48549999999999999,0.50953999999999999,0.5494,0.76910000000000001,0.51744999999999997,0.63932,0.82499999999999996]
[null,null,null,null,null,null,null,null,null,null,null,157.80000000000001,0.51734999999999998,0.63924999999999998,0.4854,0.50939999999999996,0.54930000000000001,0.76910000000000001,0.51734999999999998,0.63924999999999998,0.82499999999999996]
[null,null,null,null,null,null,null,null,null,null,null,157.9,0.51775000000000004,0.63917999999999997,0.48620000000000002,0.50925999999999993,0.54930000000000001,0.76910000000000001,0.51775000000000004,0.63917999999999997,0.82499999999999996]
[null,null,null,null,null,null,null,null,null,null,null,158,0.51719999999999999,0.63910999999999996,0.48520000000000002,0.50911999999999991,0.54920000000000002,0.76910000000000001,0.51719999999999999,0.63910999999999996,0.82499999999999996]
[null,null,null,null,null,null,null,null,null,null,null,158.1,0.51715,0.63904000000000005,0.48509999999999998,0.5089800000000001,0.54920000000000002,0.76910000000000001,0.51715,0.63904000000000005,0.82499999999999996]
[null,null,null,null,null,null,null,null,null,null,null,158.19999999999999,0.51705000000000001,0.63897000000000004,0.48499999999999999,0.50884000000000007,0.54910000000000003,0.76910000000000001,0.51705000000000001,0.63897000000000004,0.82499999999999996]
[null,null,null,null,null,null,null,null,null,null,null,158.30000000000001,0.51705000000000001,0.63890000000000002,0.48499999999999999,0.50870000000000004,0.54910000000000003,0.76910000000000001,0.51705000000000001,0.63890000000000002,0.82499999999999996]
[null,null,null,null,null,null,null,null,null,null,null,158.4,0.51695000000000002,0.63883000000000001,0.4849,0.50856000000000001,0.54900000000000004,0.76910000000000001,0.51695000000000002,0.63883000000000001,0.82499999999999996]
[null,null,null,null,null,null,null,null,null,null,null,158.5,0.51690000000000003,0.63875999999999999,0.48480000000000001,0.50841999999999998,0.54900000000000004,0.76910000000000001,0.51690000000000003,0.63875999999999999,0.82499999999999996]
[null,null,null,null,null,null,null,null,null,null,null,158.6,0.51680000000000004,0.63868999999999998,0.48470000000000002,0.50827999999999995,0.54890000000000005,0.76910000000000001,0.51680000000000004,0.63868999999999998,0.82499999999999996]
[null,null,null,null,null,null,null,null,null,null,null,158.69999999999999,0.51675000000000004,0.63861999999999997,0.48459999999999998,0.50813999999999993,0.54890000000000005,0.76910000000000001,0.51675000000000004,0.63861999999999997,0.82499999999999996]
[null,null,null,null,null,null,null,null,null,null,null,158.80000000000001,0.51664999999999994,0.63854999999999995,0.48449999999999999,0.5079999999999999,0.54879999999999995,0.76910000000000001,0.51664999999999994,0.63854999999999995,0.82479999999999998]
[null,null,null,null,null,null,null,null,null,null,null,158.9,0.51705000000000001,0.63848000000000005,0.48530000000000001,0.50786000000000009,0.54879999999999995,0.76910000000000001,0.51705000000000001,0.63848000000000005,0.82439999999999991]
[null,null,null,null,null,null,null,null,null,null,null,159,0.51649999999999996,0.63841000000000003,0.48430000000000001,0.50772000000000006,0.54869999999999997,0.76910000000000001,0.51649999999999996,0.63841000000000003,0.82399999999999995]
[null,null,null,null,null,null,null,null,null,null,null,159.1,0.51644999999999996,0.63834000000000002,0.48420000000000002,0.50758000000000003,0.54869999999999997,0.76910000000000001,0.51644999999999996,0.63834000000000002,0.82399999999999995]
[null,null,null,null,null,null,null,null,null,null,null,159.19999999999999,0.51634999999999998,0.63827,0.48409999999999997,0.50744,0.54859999999999998,0.76910000000000001,0.51634999999999998,0.63827,0.82399999999999995]
[null,null,null,null,null,null,null,null,null,null,null,159.30000000000001,0.51634999999999998,0.63819999999999999,0.48409999999999997,0.50729999999999997,0.54859999999999998,0.76910000000000001,0.51634999999999998,0.63819999999999999,0.82399999999999995]
[null,null,null,null,null,null,null,null,null,null,null,159.4,0.51624999999999999,0.63812999999999998,0.48399999999999999,0.50715999999999994,0.54849999999999999,0.76910000000000001,0.51624999999999999,0.63812999999999998,0.82399999999999995]
[null,null,null,null,null,null,null,null,null,null,null,159.5,0.51619999999999999,0.63805999999999996,0.4839,0.50701999999999992,0.54849999999999999,0.76910000000000001,0.51619999999999999,0.63805999999999996,0.82399999999999995]
[null,null,null,null,null,null,null,null,null,null,null,159.6,0.5161,0.63798999999999995,0.48380000000000001,0.50687999999999989,0.5484,0.76910000000000001,0.5161,0.63798999999999995,0.82399999999999995]
[null,null,null,null,null,null,null,null,null,null,null,159.69999999999999,0.51605000000000001,0.63792000000000004,0.48370000000000002,0.50674000000000008,0.5484,0.76910000000000001,0.51605000000000001,0.63792000000000004,0.82399999999999995]
[null,null,null,null,null,null,null,null,null,null,null,159.80000000000001,0.51595000000000002,0.63785000000000003,0.48359999999999997,0.50660000000000005,0.54830000000000001,0.76910000000000001,0.51595000000000002,0.63785000000000003,0.82399999999999995]
[null,null,null,null,null,null,null,null,null,null,null,159.9,0.51634999999999998,0.63778000000000001,0.4844,0.50646000000000002,0.54830000000000001,0.76910000000000001,0.51634999999999998,0.63778000000000001,0.82399999999999995]
[null,null,null,null,null,null,null,null,null,null,null,160,0.51580000000000004,0.63771,0.4834,0.50631999999999999,0.54820000000000002,0.76910000000000001,0.51580000000000004,0.63771,0.82399999999999995]
[null,null,null,null,null,null,null,null,null,null,null,160.1,0.51575000000000004,0.63763999999999998,0.48330000000000001,0.50617999999999996,0.54820000000000002,0.76910000000000001,0.51575000000000004,0.63763999999999998,0.82399999999999995]
[null,null,null,null,null,null,null,null,null,null,null,160.19999999999999,0.51565000000000005,0.63756999999999997,0.48320000000000002,0.50603999999999993,0.54810000000000003,0.76910000000000001,0.51565000000000005,0.63756999999999997,0.82399999999999995]
[null,null,null,null,null,null,null,null,null,null,null,160.30000000000001,0.51565000000000005,0.63749999999999996,0.48320000000000002,0.50589999999999991,0.54810000000000003,0.76910000000000001,0.51565000000000005,0.63749999999999996,0.82399999999999995]
[null,null,null,null,null,null,null,null,null,null,null,160.4,0.51554999999999995,0.63743000000000005,0.48309999999999997,0.5057600000000001,0.54800000000000004,0.76910000000000001,0.51554999999999995,0.63743000000000005,0.82399999999999995]
[null,null,null,null,null,null,null,null,null,null,null,160.5,0.51550000000000007,0.63736000000000004,0.48299999999999998,0.50562000000000007,0.54800000000000004,0.76910000000000001,0.51550000000000007,0.63736000000000004,0.82399999999999995]
[null,null,null,null,null,null,null,null,null,null,null,160.6,0.51540000000000008,0.63729000000000002,0.4829,0.50548000000000004,0.54790000000000005,0.76910000000000001,0.51540000000000008,0.63729000000000002,0.8236]
[null,null,null,null,null,null,null,null,null,null,null,160.69999999999999,0.51534999999999997,0.63722000000000001,0.48280000000000001,0.50534000000000001,0.54790000000000005,0.76910000000000001,0.51534999999999997,0.63722000000000001,0.82319999999999993]
[null,null,null,null,null,null,null,null,null,null,null,160.80000000000001,0.51524999999999999,0.63714999999999999,0.48270000000000002,0.50519999999999998,0.54779999999999995,0.76910000000000001,0.51524999999999999,0.63714999999999999,0.82299999999999995]
[null,null,null,null,null,null,null,null,null,null,null,160.9,0.51564999999999994,0.63707999999999998,0.48349999999999999,0.50505999999999995,0.54779999999999995,0.76910000000000001,0.51564999999999994,0.63707999999999998,0.82299999999999995]
[null,null,null,null,null,null,null,null,null,null,null,161,0.5151,0.63700999999999997,0.48249999999999998,0.50491999999999992,0.54769999999999996,0.76910000000000001,0.5151,0.63700999999999997,0.82299999999999995]
[null,null,null,null,null,null,null,null,null,null,null,161.1,0.51505000000000001,0.63693999999999995,0.4824,0.5047799999999999,0.54769999999999996,0.76910000000000001,0.51505000000000001,0.63693999999999995,0.82299999999999995]
[null,null,null,null,null,null,null,null,null,null,null,161.19999999999999,0.51495000000000002,0.63687000000000005,0.48230000000000001,0.50464000000000009,0.54759999999999998,0.76910000000000001,0.51495000000000002,0.63687000000000005,0.82299999999999995]
[null,null,null,null,null,null,null,null,null,null,null,161.30000000000001,0.51495000000000002,0.63680000000000003,0.48230000000000001,0.50450000000000006,0.54759999999999998,0.76910000000000001,0.51495000000000002,0.63680000000000003,0.82299999999999995]
[null,null,null,null,null,null,null,null,null,null,null,161.4,0.51485000000000003,0.63673000000000002,0.48220000000000002,0.50436000000000003,0.54749999999999999,0.76910000000000001,0.51485000000000003,0.63673000000000002,0.82299999999999995]
[null,null,null,null,null,null,null,null,null,null,null,161.5,0.51479999999999992,0.63666,0.48209999999999997,0.50422,0.54749999999999999,0.76910000000000001,0.51479999999999992,0.63666,0.82299999999999995]
[null,null,null,null,null,null,null,null,null,null,null,161.6,0.51469999999999994,0.63658999999999999,0.48199999999999998,0.50407999999999997,0.5474,0.76910000000000001,0.51469999999999994,0.63658999999999999,0.82299999999999995]
[null,null,null,null,null,null,null,null,null,null,null,161.69999999999999,0.51465000000000005,0.63651999999999997,0.4819,0.50393999999999994,0.5474,0.76910000000000001,0.51465000000000005,0.63651999999999997,0.82299999999999995]
[null,null,null,null,null,null,null,null,null,null,null,161.80000000000001,0.51455000000000006,0.63644999999999996,0.48180000000000001,0.50379999999999991,0.54730000000000001,0.76910000000000001,0.51455000000000006,0.63644999999999996,0.82299999999999995]
[null,null,null,null,null,null,null,null,null,null,null,161.9,0.51495000000000002,0.63634999999999997,0.48259999999999997,0.50359999999999994,0.54730000000000001,0.76910000000000001,0.51495000000000002,0.63634999999999997,0.82299999999999995]
[null,null,null,null,null,null,null,null,null,null,null,162,0.51439999999999997,0.63627999999999996,0.48159999999999997,0.50345999999999991,0.54720000000000002,0.76910000000000001,0.51439999999999997,0.63627999999999996,0.82299999999999995]
[null,null,null,null,null,null,null,null,null,null,null,162.1,0.51429999999999998,0.63621000000000005,0.48149999999999998,0.5033200000000001,0.54710000000000003,0.76910000000000001,0.51429999999999998,0.63621000000000005,0.82299999999999995]
[null,null,null,null,null,null,null,null,null,null,null,162.19999999999999,0.51424999999999998,0.63614000000000004,0.48139999999999999,0.50318000000000007,0.54710000000000003,0.76910000000000001,0.51424999999999998,0.63614000000000004,0.82299999999999995]
[null,null,null,null,null,null,null,null,null,null,null,162.30000000000001,0.51419999999999999,0.63607000000000002,0.48139999999999999,0.50304000000000004,0.54700000000000004,0.76910000000000001,0.51419999999999999,0.63607000000000002,0.82279999999999998]
[null,null,null,null,null,null,null,null,null,null,null,162.4,0.51415,0.63600000000000001,0.48130000000000001,0.50290000000000001,0.54700000000000004,0.76910000000000001,0.51415,0.63600000000000001,0.82239999999999991]
[null,null,null,null,null,null,null,null,null,null,null,162.5,0.51405000000000001,0.63593,0.48120000000000002,0.50275999999999998,0.54690000000000005,0.76910000000000001,0.51405000000000001,0.63593,0.82199999999999995]
[null,null,null,null,null,null,null,null,null,null,null,162.6,0.51400000000000001,0.63585999999999998,0.48110000000000003,0.50261999999999996,0.54690000000000005,0.76910000000000001,0.51400000000000001,0.63585999999999998,0.82199999999999995]
[null,null,null,null,null,null,null,null,null,null,null,162.69999999999999,0.51390000000000002,0.63578999999999997,0.48099999999999998,0.50247999999999993,0.54679999999999995,0.76910000000000001,0.51390000000000002,0.63578999999999997,0.82199999999999995]
[null,null,null,null,null,null,null,null,null,null,null,162.80000000000001,0.51384999999999992,0.63571999999999995,0.48089999999999999,0.5023399999999999,0.54679999999999995,0.76910000000000001,0.51384999999999992,0.63571999999999995,0.82199999999999995]
[null,null,null,null,null,null,null,null,null,null,null,162.9,0.51419999999999999,0.63565000000000005,0.48170000000000002,0.50220000000000009,0.54669999999999996,0.76910000000000001,0.51419999999999999,0.63565000000000005,0.82199999999999995]
[null,null,null,null,null,null,null,null,null,null,null,163,0.51370000000000005,0.63558000000000003,0.48070000000000002,0.50206000000000006,0.54669999999999996,0.76910000000000001,0.51370000000000005,0.63558000000000003,0.82199999999999995]
[null,null,null,null,null,null,null,null,null,null,null,163.1,0.51360000000000006,0.63551000000000002,0.48060000000000003,0.50192000000000003,0.54659999999999997,0.76910000000000001,0.51360000000000006,0.63551000000000002,0.82199999999999995]
[null,null,null,null,null,null,null,null,null,null,null,163.19999999999999,0.51354999999999995,0.63544,0.48049999999999998,0.50178,0.54659999999999997,0.76910000000000001,0.51354999999999995,0.63544,0.82199999999999995]
[null,null,null,null,null,null,null,null,null,null,null,163.30000000000001,0.51349999999999996,0.63536999999999999,0.48049999999999998,0.50163999999999997,0.54649999999999999,0.76910000000000001,0.51349999999999996,0.63536999999999999,0.82199999999999995]
[null,null,null,null,null,null,null,null,null,null,null,163.4,0.51344999999999996,0.63529999999999998,0.48039999999999999,0.50149999999999995,0.54649999999999999,0.76910000000000001,0.51344999999999996,0.63529999999999998,0.82199999999999995]
[null,null,null,null,null,null,null,null,null,null,null,163.5,0.51334999999999997,0.63522999999999996,0.4803,0.50135999999999992,0.5464,0.76910000000000001,0.51334999999999997,0.63522999999999996,0.82199999999999995]
[null,null,null,null,null,null,null,null,null,null,null,163.6,0.51329999999999998,0.63515999999999995,0.48020000000000002,0.50121999999999989,0.5464,0.76910000000000001,0.51329999999999998,0.63515999999999995,0.82199999999999995]
[null,null,null,null,null,null,null,null,null,null,null,163.69999999999999,0.51319999999999999,0.63509000000000004,0.48010000000000003,0.50108000000000008,0.54630000000000001,0.76910000000000001,0.51319999999999999,0.63509000000000004,0.82199999999999995]
[null,null,null,null,null,null,null,null,null,null,null,163.80000000000001,0.51315,0.63502000000000003,0.48,0.50094000000000005,0.54630000000000001,0.76910000000000001,0.51315,0.63502000000000003,0.82199999999999995]
[null,null,null,null,null,null,null,null,null,null,null,163.9,0.51350000000000007,0.63495000000000001,0.48080000000000001,0.50080000000000002,0.54620000000000002,0.76910000000000001,0.51350000000000007,0.63495000000000001,0.82199999999999995]
[null,null,null,null,null,null,null,null,null,null,null,164,0.51300000000000001,0.63488,0.4798,0.50065999999999999,0.54620000000000002,0.76910000000000001,0.51300000000000001,0.63488,0.82199999999999995]
[null,null,null,null,null,null,null,null,null,null,null,164.1,0.51290000000000002,0.63480999999999999,0.47970000000000002,0.50051999999999996,0.54610000000000003,0.76910000000000001,0.51290000000000002,0.63480999999999999,0.8216]
[null,null,null,null,null,null,null,null,null,null,null,164.2,0.51285000000000003,0.63473999999999997,0.47960000000000003,0.50037999999999994,0.54610000000000003,0.76910000000000001,0.51285000000000003,0.63473999999999997,0.82119999999999993]
[null,null,null,null,null,null,null,null,null,null,null,164.3,0.51280000000000003,0.63466999999999996,0.47960000000000003,0.50023999999999991,0.54600000000000004,0.76910000000000001,0.51280000000000003,0.63466999999999996,0.82099999999999995]
[null,null,null,null,null,null,null,null,null,null,null,164.4,0.51275000000000004,0.63460000000000005,0.47949999999999998,0.5001000000000001,0.54600000000000004,0.76910000000000001,0.51275000000000004,0.63460000000000005,0.82099999999999995]
[null,null,null,null,null,null,null,null,null,null,null,164.5,0.51265000000000005,0.63453000000000004,0.47939999999999999,0.49996000000000007,0.54590000000000005,0.76910000000000001,0.51265000000000005,0.63453000000000004,0.82099999999999995]
[null,null,null,null,null,null,null,null,null,null,null,164.6,0.51260000000000006,0.63446000000000002,0.4793,0.49982000000000004,0.54590000000000005,0.76910000000000001,0.51260000000000006,0.63446000000000002,0.82099999999999995]
[null,null,null,null,null,null,null,null,null,null,null,164.7,0.51249999999999996,0.63439000000000001,0.47920000000000001,0.49968000000000001,0.54579999999999995,0.76910000000000001,0.51249999999999996,0.63439000000000001,0.82099999999999995]
[null,null,null,null,null,null,null,null,null,null,null,164.8,0.51244999999999996,0.63431999999999999,0.47910000000000003,0.49953999999999998,0.54579999999999995,0.76910000000000001,0.51244999999999996,0.63431999999999999,0.82099999999999995]
[null,null,null,null,null,null,null,null,null,null,null,164.9,0.51279999999999992,0.63424999999999998,0.47989999999999999,0.49939999999999996,0.54569999999999996,0.76910000000000001,0.51279999999999992,0.63424999999999998,0.82099999999999995]
[null,null,null,null,null,null,null,null,null,null,null,165,0.51229999999999998,0.63419000000000003,0.47889999999999999,0.49928000000000006,0.54569999999999996,0.76910000000000001,0.51229999999999998,0.63419000000000003,0.82099999999999995]
[null,null,null,null,null,null,null,null,null,null,null,165.1,0.51219999999999999,0.63412000000000002,0.4788,0.49914000000000003,0.54559999999999997,0.76910000000000001,0.51219999999999999,0.63412000000000002,0.82099999999999995]
[null,null,null,null,null,null,null,null,null,null,null,165.2,0.51214999999999999,0.63405999999999996,0.47870000000000001,0.49901999999999991,0.54559999999999997,0.76910000000000001,0.51214999999999999,0.63405999999999996,0.82099999999999995]
[null,null,null,null,null,null,null,null,null,null,null,165.3,0.5121,0.63399000000000005,0.47870000000000001,0.4988800000000001,0.54549999999999998,0.76910000000000001,0.5121,0.63399000000000005,0.82099999999999995]
[null,null,null,null,null,null,null,null,null,null,null,165.4,0.51205000000000001,0.63392999999999999,0.47860000000000003,0.49875999999999998,0.54549999999999998,0.76910000000000001,0.51205000000000001,0.63392999999999999,0.82099999999999995]
[null,null,null,null,null,null,null,null,null,null,null,165.5,0.51195000000000002,0.63385999999999998,0.47849999999999998,0.49861999999999995,0.5454,0.76910000000000001,0.51195000000000002,0.63385999999999998,0.82099999999999995]
[null,null,null,null,null,null,null,null,null,null,null,165.6,0.51190000000000002,0.63380000000000003,0.47839999999999999,0.49850000000000005,0.5454,0.76910000000000001,0.51190000000000002,0.63380000000000003,0.82099999999999995]
[null,null,null,null,null,null,null,null,null,null,null,165.7,0.51180000000000003,0.63373000000000002,0.4783,0.49836000000000003,0.54530000000000001,0.76910000000000001,0.51180000000000003,0.63373000000000002,0.82099999999999995]
[null,null,null,null,null,null,null,null,null,null,null,165.8,0.51175000000000004,0.63366999999999996,0.47820000000000001,0.49823999999999991,0.54530000000000001,0.76910000000000001,0.51175000000000004,0.63366999999999996,0.82079999999999997]
[null,null,null,null,null,null,null,null,null,null,null,165.9,0.5121,0.63360000000000005,0.47899999999999998,0.4981000000000001,0.54520000000000002,0.76910000000000001,0.5121,0.63360000000000005,0.82039999999999991]
[null,null,null,null,null,null,null,null,null,null,null,166,0.51172499999999999,0.63353999999999999,0.47824999999999995,0.49797999999999998,0.54520000000000002,0.76910000000000001,0.51172499999999999,0.63353999999999999,0.82]
[null,null,null,null,null,null,null,null,null,null,null,166.1,0.51163499999999995,0.63346999999999998,0.47816999999999987,0.49783999999999995,0.54510000000000003,0.76910000000000001,0.51163499999999995,0.63346999999999998,0.82]
[null,null,null,null,null,null,null,null,null,null,null,166.2,0.51159500000000002,0.63341000000000003,0.47809000000000001,0.49772000000000005,0.54510000000000003,0.76910000000000001,0.51159500000000002,0.63341000000000003,0.82]
[null,null,null,null,null,null,null,null,null,null,null,166.3,0.51150499999999999,0.63334000000000001,0.47800999999999993,0.49758000000000002,0.54500000000000004,0.76910000000000001,0.51150499999999999,0.63334000000000001,0.82]
[null,null,null,null,null,null,null,null,null,null,null,166.4,0.51146499999999995,0.63327999999999995,0.47792999999999985,0.4974599999999999,0.54500000000000004,0.76910000000000001,0.51146499999999995,0.63327999999999995,0.82]
[null,null,null,null,null,null,null,null,null,null,null,166.5,0.51137500000000002,0.63321000000000005,0.47785,0.4973200000000001,0.54490000000000005,0.76910000000000001,0.51137500000000002,0.63321000000000005,0.82]
[null,null,null,null,null,null,null,null,null,null,null,166.6,0.51133499999999998,0.63314999999999999,0.47776999999999992,0.49719999999999998,0.54490000000000005,0.76910000000000001,0.51133499999999998,0.63314999999999999,0.82]
[null,null,null,null,null,null,null,null,null,null,null,166.7,0.51124499999999995,0.63307999999999998,0.47768999999999995,0.49705999999999995,0.54479999999999995,0.76910000000000001,0.51124499999999995,0.63307999999999998,0.82]
[null,null,null,null,null,null,null,null,null,null,null,166.8,0.51120500000000002,0.63302000000000003,0.47761000000000009,0.49694000000000005,0.54479999999999995,0.76910000000000001,0.51120500000000002,0.63302000000000003,0.82]
[null,null,null,null,null,null,null,null,null,null,null,166.9,0.51111499999999999,0.63295000000000001,0.47753000000000001,0.49680000000000002,0.54469999999999996,0.76910000000000001,0.51111499999999999,0.63295000000000001,0.82]
[null,null,null,null,null,null,null,null,null,null,null,167,0.51107499999999995,0.63292000000000004,0.47744999999999993,0.49674000000000007,0.54469999999999996,0.76910000000000001,0.51107499999999995,0.63292000000000004,0.82]
[null,null,null,null,null,null,null,null,null,null,null,167.1,0.51098500000000002,0.63292000000000004,0.47737000000000007,0.49674000000000007,0.54459999999999997,0.76910000000000001,0.51098500000000002,0.63292000000000004,0.82]
[null,null,null,null,null,null,null,null,null,null,null,167.2,0.51094499999999998,0.63292000000000004,0.47728999999999999,0.49674000000000007,0.54459999999999997,0.76910000000000001,0.51094499999999998,0.63292000000000004,0.82]
[null,null,null,null,null,null,null,null,null,null,null,167.3,0.51085499999999995,0.63268999999999997,0.47720999999999991,0.49627999999999994,0.54449999999999998,0.76910000000000001,0.51085499999999995,0.63268999999999997,0.82]
[null,null,null,null,null,null,null,null,null,null,null,167.4,0.51081500000000002,0.63263000000000003,0.47713000000000005,0.49616000000000005,0.54449999999999998,0.76910000000000001,0.51081500000000002,0.63263000000000003,0.82]
[null,null,null,null,null,null,null,null,null,null,null,167.5,0.51072499999999998,0.63256000000000001,0.47704999999999997,0.49602000000000002,0.5444,0.76910000000000001,0.51072499999999998,0.63256000000000001,0.82]
[null,null,null,null,null,null,null,null,null,null,null,167.6,0.51068499999999994,0.63249999999999995,0.47696999999999989,0.4958999999999999,0.5444,0.76910000000000001,0.51068499999999994,0.63249999999999995,0.8196]
[null,null,null,null,null,null,null,null,null,null,null,167.7,0.51059500000000002,0.63243000000000005,0.47689000000000004,0.49576000000000009,0.54430000000000001,0.76910000000000001,0.51059500000000002,0.63243000000000005,0.81919999999999993]
[null,null,null,null,null,null,null,null,null,null,null,167.8,0.51055499999999998,0.63236999999999999,0.47680999999999996,0.49563999999999997,0.54430000000000001,0.76910000000000001,0.51055499999999998,0.63236999999999999,0.81899999999999995]
[null,null,null,null,null,null,null,null,null,null,null,167.9,0.51046499999999995,0.63229999999999997,0.47672999999999988,0.49549999999999994,0.54420000000000002,0.76910000000000001,0.51046499999999995,0.63229999999999997,0.81899999999999995]
[null,null,null,null,null,null,null,null,null,null,null,168.00000000000099,0.51042500000000002,0.63224000000000002,0.47665000000000002,0.49538000000000004,0.54420000000000002,0.76910000000000001,0.51042500000000002,0.63224000000000002,0.81899999999999995]
[null,null,null,null,null,null,null,null,null,null,null,168.10000000000099,0.51033499999999998,0.63217000000000001,0.47656999999999994,0.49524000000000001,0.54410000000000003,0.76910000000000001,0.51033499999999998,0.63217000000000001,0.81899999999999995]
[null,null,null,null,null,null,null,null,null,null,null,168.20000000000101,0.51029500000000005,0.63210999999999995,0.47649000000000008,0.49511999999999989,0.54410000000000003,0.76910000000000001,0.51029500000000005,0.63210999999999995,0.81899999999999995]
[null,null,null,null,null,null,null,null,null,null,null,168.30000000000101,0.51020500000000002,0.63204000000000005,0.47641,0.49498000000000009,0.54400000000000004,0.76910000000000001,0.51020500000000002,0.63204000000000005,0.81899999999999995]
[null,null,null,null,null,null,null,null,null,null,null,168.400000000001,0.51016499999999998,0.63197999999999999,0.47632999999999992,0.49485999999999997,0.54400000000000004,0.76910000000000001,0.51016499999999998,0.63197999999999999,0.81899999999999995]
[null,null,null,null,null,null,null,null,null,null,null,168.50000000000099,0.51007499999999995,0.63192000000000004,0.47625000000000001,0.49474000000000007,0.54390000000000005,0.76910000000000001,0.51007499999999995,0.63192000000000004,0.81899999999999995]
[null,null,null,null,null,null,null,null,null,null,null,168.60000000000099,0.51003500000000002,0.63185000000000002,0.47616999999999998,0.49460000000000004,0.54390000000000005,0.76910000000000001,0.51003500000000002,0.63185000000000002,0.81899999999999995]
[null,null,null,null,null,null,null,null,null,null,null,168.70000000000101,0.50994499999999998,0.63178999999999996,0.47609000000000001,0.49447999999999992,0.54379999999999995,0.76910000000000001,0.50994499999999998,0.63178999999999996,0.81899999999999995]
[null,null,null,null,null,null,null,null,null,null,null,168.80000000000101,0.50990500000000005,0.63171999999999995,0.47601000000000016,0.49433999999999989,0.54379999999999995,0.76910000000000001,0.50990500000000005,0.63171999999999995,0.81899999999999995]
[null,null,null,null,null,null,null,null,null,null,null,168.900000000001,0.50981500000000002,0.63166,0.47593000000000008,0.49421999999999999,0.54369999999999996,0.76910000000000001,0.50981500000000002,0.63166,0.81899999999999995]
[null,null,null,null,null,null,null,null,null,null,null,169.00000000000099,0.50972499999999998,0.63158999999999998,0.47585,0.49407999999999996,0.54359999999999997,0.76910000000000001,0.50972499999999998,0.63158999999999998,0.81899999999999995]
[null,null,null,null,null,null,null,null,null,null,null,169.10000000000099,0.50968500000000005,0.63153000000000004,0.47577000000000014,0.49396000000000007,0.54359999999999997,0.76910000000000001,0.50968500000000005,0.63153000000000004,0.81899999999999995]
[null,null,null,null,null,null,null,null,null,null,null,169.20000000000101,0.50959500000000002,0.63146000000000002,0.47569000000000006,0.49382000000000004,0.54349999999999998,0.76910000000000001,0.50959500000000002,0.63146000000000002,0.81899999999999995]
[null,null,null,null,null,null,null,null,null,null,null,169.30000000000101,0.50955499999999998,0.63139999999999996,0.47560999999999998,0.49369999999999992,0.54349999999999998,0.76910000000000001,0.50955499999999998,0.63139999999999996,0.81879999999999997]
[null,null,null,null,null,null,null,null,null,null,null,169.400000000001,0.50946499999999995,0.63132999999999995,0.4755299999999999,0.49355999999999989,0.54339999999999999,0.76910000000000001,0.50946499999999995,0.63132999999999995,0.81839999999999991]
[null,null,null,null,null,null,null,null,null,null,null,169.50000000000099,0.50942500000000002,0.63127,0.47545000000000004,0.49343999999999999,0.54339999999999999,0.76910000000000001,0.50942500000000002,0.63127,0.81799999999999995]
[null,null,null,null,null,null,null,null,null,null,null,169.60000000000099,0.50933499999999998,0.63119999999999998,0.47536999999999996,0.49329999999999996,0.54330000000000001,0.76910000000000001,0.50933499999999998,0.63119999999999998,0.81799999999999995]
[null,null,null,null,null,null,null,null,null,null,null,169.70000000000101,0.50929500000000005,0.63114000000000003,0.4752900000000001,0.49318000000000006,0.54330000000000001,0.76910000000000001,0.50929500000000005,0.63114000000000003,0.81799999999999995]
[null,null,null,null,null,null,null,null,null,null,null,169.80000000000101,0.50920500000000002,0.63107000000000002,0.47521000000000002,0.49304000000000003,0.54320000000000002,0.76910000000000001,0.50920500000000002,0.63107000000000002,0.81799999999999995]
[null,null,null,null,null,null,null,null,null,null,null,169.900000000001,0.50916499999999998,0.63100999999999996,0.47512999999999994,0.49291999999999991,0.54320000000000002,0.76910000000000001,0.50916499999999998,0.63100999999999996,0.81799999999999995]
[null,null,null,null,null,null,null,null,null,null,null,170.00000000000099,0.50907500000000006,0.63093999999999995,0.47505000000000008,0.49277999999999988,0.54310000000000003,0.76910000000000001,0.50907500000000006,0.63093999999999995,0.81799999999999995]
[null,null,null,null,null,null,null,null,null,null,null,170.10000000000099,0.50903500000000002,0.63081500000000001,0.47497,0.49253000000000002,0.54310000000000003,0.76910000000000001,0.50903500000000002,0.63081500000000001,0.81799999999999995]
[null,null,null,null,null,null,null,null,null,null,null,170.20000000000101,0.50894499999999998,0.63068500000000005,0.47488999999999992,0.4922700000000001,0.54300000000000004,0.76910000000000001,0.50894499999999998,0.63068500000000005,0.81799999999999995]
[null,null,null,null,null,null,null,null,null,null,null,170.30000000000101,0.50890500000000005,0.63055500000000009,0.47481000000000007,0.49201000000000017,0.54300000000000004,0.76910000000000001,0.50890500000000005,0.63055500000000009,0.81799999999999995]
[null,null,null,null,null,null,null,null,null,null,null,170.400000000001,0.50881500000000002,0.63042500000000012,0.47472999999999999,0.49175000000000024,0.54290000000000005,0.76910000000000001,0.50881500000000002,0.63042500000000012,0.81799999999999995]
[null,null,null,null,null,null,null,null,null,null,null,170.50000000000099,0.50877499999999998,0.63029500000000016,0.47464999999999991,0.49149000000000032,0.54290000000000005,0.76910000000000001,0.50877499999999998,0.63029500000000016,0.81799999999999995]
[null,null,null,null,null,null,null,null,null,null,null,170.60000000000099,0.50868500000000005,0.6301650000000002,0.47457000000000016,0.49123000000000039,0.54279999999999995,0.76910000000000001,0.50868500000000005,0.6301650000000002,0.81799999999999995]
[null,null,null,null,null,null,null,null,null,null,null,170.70000000000101,0.50864500000000001,0.63003500000000023,0.47449000000000008,0.49097000000000046,0.54279999999999995,0.76910000000000001,0.50864500000000001,0.63003500000000023,0.81799999999999995]
[null,null,null,null,null,null,null,null,null,null,null,170.80000000000101,0.50855499999999998,0.62990500000000027,0.47441,0.49071000000000053,0.54269999999999996,0.76910000000000001,0.50855499999999998,0.62990500000000027,0.81799999999999995]
[null,null,null,null,null,null,null,null,null,null,null,170.900000000001,0.50851500000000005,0.62977500000000031,0.47433000000000014,0.49045000000000061,0.54269999999999996,0.76910000000000001,0.50851500000000005,0.62977500000000031,0.81799999999999995]
[null,null,null,null,null,null,null,null,null,null,null,171.00000000000099,0.50842500000000002,0.62964500000000034,0.47425000000000006,0.49019000000000068,0.54259999999999997,0.76910000000000001,0.50842500000000002,0.62964500000000034,0.81799999999999995]
[null,null,null,null,null,null,null,null,null,null,null,171.10000000000099,0.50838499999999998,0.62951500000000038,0.47416999999999998,0.48993000000000075,0.54259999999999997,0.76910000000000001,0.50838499999999998,0.62951500000000038,0.81799999999999995]
[null,null,null,null,null,null,null,null,null,null,null,171.20000000000101,0.50829500000000005,0.62938500000000042,0.47409000000000012,0.48967000000000083,0.54249999999999998,0.76910000000000001,0.50829500000000005,0.62938500000000042,0.81799999999999995]
[null,null,null,null,null,null,null,null,null,null,null,171.30000000000101,0.50825500000000001,0.62925500000000045,0.47401000000000004,0.4894100000000009,0.54249999999999998,0.76910000000000001,0.50825500000000001,0.62925500000000045,0.81779999999999997]
[null,null,null,null,null,null,null,null,null,null,null,171.400000000001,0.50816499999999998,0.62912500000000049,0.47392999999999996,0.48915000000000097,0.54239999999999999,0.76910000000000001,0.50816499999999998,0.62912500000000049,0.8173999999999999]
[null,null,null,null,null,null,null,null,null,null,null,171.50000000000099,0.50812500000000005,0.62899500000000053,0.4738500000000001,0.48889000000000105,0.54239999999999999,0.76910000000000001,0.50812500000000005,0.62899500000000053,0.81699999999999995]
[null,null,null,null,null,null,null,null,null,null,null,171.60000000000099,0.50803500000000001,0.62886500000000056,0.47377000000000002,0.48863000000000112,0.5423,0.76910000000000001,0.50803500000000001,0.62886500000000056,0.81699999999999995]
[null,null,null,null,null,null,null,null,null,null,null,171.70000000000101,0.50799499999999997,0.6287350000000006,0.47368999999999994,0.48837000000000119,0.5423,0.76910000000000001,0.50799499999999997,0.6287350000000006,0.81699999999999995]
[null,null,null,null,null,null,null,null,null,null,null,171.80000000000101,0.50790500000000005,0.62860500000000064,0.47361000000000009,0.48811000000000127,0.54220000000000002,0.76910000000000001,0.50790500000000005,0.62860500000000064,0.81699999999999995]
[null,null,null,null,null,null,null,null,null,null,null,171.900000000001,0.50786500000000001,0.62847500000000067,0.47353000000000001,0.48785000000000134,0.54220000000000002,0.76910000000000001,0.50786500000000001,0.62847500000000067,0.81699999999999995]
[null,null,null,null,null,null,null,null,null,null,null,172.00000000000099,0.50777499999999998,0.62834500000000071,0.47344999999999993,0.48759000000000141,0.54210000000000003,0.76910000000000001,0.50777499999999998,0.62834500000000071,0.81699999999999995]
[null,null,null,null,null,null,null,null,null,null,null,172.10000000000099,0.50773500000000005,0.62821500000000075,0.47337000000000007,0.48733000000000148,0.54210000000000003,0.76910000000000001,0.50773500000000005,0.62821500000000075,0.81699999999999995]
[null,null,null,null,null,null,null,null,null,null,null,172.20000000000101,0.50764500000000001,0.62808500000000078,0.47328999999999999,0.48707000000000156,0.54200000000000004,0.76910000000000001,0.50764500000000001,0.62808500000000078,0.81699999999999995]
[null,null,null,null,null,null,null,null,null,null,null,172.30000000000101,0.50760499999999997,0.62795500000000082,0.47320999999999991,0.48681000000000163,0.54200000000000004,0.76910000000000001,0.50760499999999997,0.62795500000000082,0.81699999999999995]
[null,null,null,null,null,null,null,null,null,null,null,172.400000000002,0.50751500000000005,0.62782500000000085,0.47313000000000005,0.4865500000000017,0.54190000000000005,0.76910000000000001,0.50751500000000005,0.62782500000000085,0.81699999999999995]
[null,null,null,null,null,null,null,null,null,null,null,172.50000000000199,0.50747500000000001,0.62769500000000089,0.47304999999999997,0.48629000000000178,0.54190000000000005,0.76910000000000001,0.50747500000000001,0.62769500000000089,0.81699999999999995]
[null,null,null,null,null,null,null,null,null,null,null,172.60000000000201,0.50738499999999997,0.62756500000000093,0.47297,0.48603000000000185,0.54179999999999995,0.76910000000000001,0.50738499999999997,0.62756500000000093,0.81699999999999995]
[null,null,null,null,null,null,null,null,null,null,null,172.70000000000201,0.50734500000000005,0.62743500000000096,0.47289000000000014,0.48577000000000192,0.54179999999999995,0.76910000000000001,0.50734500000000005,0.62743500000000096,0.81699999999999995]
[null,null,null,null,null,null,null,null,null,null,null,172.800000000002,0.50725500000000001,0.627305000000001,0.47281000000000006,0.485510000000002,0.54169999999999996,0.76910000000000001,0.50725500000000001,0.627305000000001,0.81699999999999995]
[null,null,null,null,null,null,null,null,null,null,null,172.900000000002,0.50721499999999997,0.62717500000000104,0.47272999999999998,0.48525000000000207,0.54169999999999996,0.76910000000000001,0.50721499999999997,0.62717500000000104,0.81699999999999995]
[null,null,null,null,null,null,null,null,null,null,null,173.00000000000199,0.50712500000000005,0.62704500000000107,0.47265000000000013,0.48499000000000214,0.54159999999999997,0.76910000000000001,0.50712500000000005,0.62704500000000107,0.81699999999999995]
[null,null,null,null,null,null,null,null,null,null,null,173.10000000000201,0.50708500000000001,0.62691500000000111,0.47257000000000005,0.48473000000000221,0.54159999999999997,0.76910000000000001,0.50708500000000001,0.62691500000000111,0.81699999999999995]
[null,null,null,null,null,null,null,null,null,null,null,173.20000000000201,0.50699499999999997,0.62678500000000115,0.47248999999999997,0.48447000000000229,0.54149999999999998,0.76910000000000001,0.50699499999999997,0.62678500000000115,0.81699999999999995]
[null,null,null,null,null,null,null,null,null,null,null,173.300000000002,0.50695500000000004,0.62665500000000118,0.47241000000000011,0.48421000000000236,0.54149999999999998,0.76910000000000001,0.50695500000000004,0.62665500000000118,0.81679999999999997]
[null,null,null,null,null,null,null,null,null,null,null,173.400000000002,0.50686500000000001,0.62652500000000122,0.47233000000000003,0.48395000000000243,0.54139999999999999,0.76910000000000001,0.50686500000000001,0.62652500000000122,0.8163999999999999]
[null,null,null,null,null,null,null,null,null,null,null,173.50000000000199,0.50682499999999997,0.62639500000000126,0.47224999999999995,0.48369000000000251,0.54139999999999999,0.76910000000000001,0.50682499999999997,0.62639500000000126,0.81599999999999995]
[null,null,null,null,null,null,null,null,null,null,null,173.60000000000201,0.50673500000000005,0.62626500000000129,0.47217000000000009,0.48343000000000258,0.5413,0.76910000000000001,0.50673500000000005,0.62626500000000129,0.81599999999999995]
[null,null,null,null,null,null,null,null,null,null,null,173.70000000000201,0.50669500000000001,0.62613500000000133,0.47209000000000001,0.48317000000000265,0.5413,0.76910000000000001,0.50669500000000001,0.62613500000000133,0.81599999999999995]
[null,null,null,null,null,null,null,null,null,null,null,173.800000000002,0.50660499999999997,0.62600500000000137,0.47200999999999993,0.48291000000000273,0.54120000000000001,0.76910000000000001,0.50660499999999997,0.62600500000000137,0.81599999999999995]
[null,null,null,null,null,null,null,null,null,null,null,173.900000000002,0.50656500000000004,0.6258750000000014,0.47193000000000007,0.4826500000000028,0.54120000000000001,0.76910000000000001,0.50656500000000004,0.6258750000000014,0.81599999999999995]
[null,null,null,null,null,null,null,null,null,null,null,174.00000000000199,0.50647500000000001,0.62574500000000144,0.47184999999999999,0.48239000000000287,0.54110000000000003,0.76910000000000001,0.50647500000000001,0.62574500000000144,0.81599999999999995]
[null,null,null,null,null,null,null,null,null,null,null,174.10000000000201,0.50643499999999997,0.62561500000000148,0.47176999999999991,0.48213000000000295,0.54110000000000003,0.76910000000000001,0.50643499999999997,0.62561500000000148,0.81599999999999995]
[null,null,null,null,null,null,null,null,null,null,null,174.20000000000201,0.50634500000000005,0.62548500000000151,0.47169000000000005,0.48187000000000302,0.54100000000000004,0.76910000000000001,0.50634500000000005,0.62548500000000151,0.81599999999999995]
[null,null,null,null,null,null,null,null,null,null,null,174.300000000002,0.50630500000000001,0.62535500000000155,0.47160999999999997,0.48161000000000309,0.54100000000000004,0.76910000000000001,0.50630500000000001,0.62535500000000155,0.81599999999999995]
[null,null,null,null,null,null,null,null,null,null,null,174.400000000002,0.50621499999999997,0.62522500000000159,0.47152999999999989,0.48135000000000316,0.54090000000000005,0.76910000000000001,0.50621499999999997,0.62522500000000159,0.81599999999999995]
[null,null,null,null,null,null,null,null,null,null,null,174.50000000000199,0.50617500000000004,0.62509500000000162,0.47145000000000004,0.48109000000000324,0.54090000000000005,0.76910000000000001,0.50617500000000004,0.62509500000000162,0.81599999999999995]
[null,null,null,null,null,null,null,null,null,null,null,174.60000000000201,0.50608500000000001,0.62496500000000166,0.47137000000000007,0.48083000000000331,0.54079999999999995,0.76910000000000001,0.50608500000000001,0.62496500000000166,0.81599999999999995]
[null,null,null,null,null,null,null,null,null,null,null,174.70000000000201,0.50604499999999997,0.62483500000000169,0.47128999999999999,0.48057000000000338,0.54079999999999995,0.76910000000000001,0.50604499999999997,0.62483500000000169,0.81599999999999995]
[null,null,null,null,null,null,null,null,null,null,null,174.800000000002,0.50595500000000004,0.62470500000000173,0.47121000000000013,0.48031000000000346,0.54069999999999996,0.76910000000000001,0.50595500000000004,0.62470500000000173,0.81599999999999995]
[null,null,null,null,null,null,null,null,null,null,null,174.900000000002,0.505915,0.62457500000000177,0.47113000000000005,0.48005000000000353,0.54069999999999996,0.76910000000000001,0.505915,0.62457500000000177,0.81599999999999995]
[null,null,null,null,null,null,null,null,null,null,null,175.00000000000199,0.50583500000000003,0.6244450000000018,0.4710700000000001,0.4797900000000036,0.54059999999999997,0.76910000000000001,0.50583500000000003,0.6244450000000018]
[null,null,null,null,null,null,null,null,null,null,null,175.10000000000201,0.50576500000000002,0.62431500000000184,0.47093000000000007,0.47953000000000368,0.54059999999999997,0.76910000000000001,0.50576500000000002,0.62431500000000184]
[null,null,null,null,null,null,null,null,null,null,null,175.20000000000201,0.50569500000000001,0.62418500000000188,0.47089000000000003,0.47927000000000375,0.54049999999999998,0.76910000000000001,0.50569500000000001,0.62418500000000188]
[null,null,null,null,null,null,null,null,null,null,null,175.300000000002,0.50562499999999999,0.62405500000000191,0.47075,0.47901000000000382,0.54049999999999998,0.76910000000000001,0.50562499999999999,0.62405500000000191]
[null,null,null,null,null,null,null,null,null,null,null,175.400000000002,0.50555499999999998,0.62392500000000195,0.47070999999999996,0.47875000000000389,0.54039999999999999,0.76910000000000001,0.50555499999999998,0.62392500000000195]
[null,null,null,null,null,null,null,null,null,null,null,175.50000000000199,0.50548499999999996,0.62379500000000199,0.47056999999999993,0.47849000000000397,0.54039999999999999,0.76910000000000001,0.50548499999999996,0.62379500000000199]
[null,null,null,null,null,null,null,null,null,null,null,175.60000000000201,0.50541499999999995,0.62366500000000202,0.47052999999999989,0.47823000000000404,0.5403,0.76910000000000001,0.50541499999999995,0.62366500000000202]
[null,null,null,null,null,null,null,null,null,null,null,175.70000000000201,0.50534500000000004,0.62353500000000206,0.47039000000000009,0.47797000000000411,0.5403,0.76910000000000001,0.50534500000000004,0.62353500000000206]
[null,null,null,null,null,null,null,null,null,null,null,175.800000000002,0.50527500000000003,0.6234050000000021,0.47035000000000005,0.47771000000000419,0.54020000000000001,0.76910000000000001,0.50527500000000003,0.6234050000000021]
[null,null,null,null,null,null,null,null,null,null,null,175.900000000002,0.50520500000000002,0.62327500000000213,0.47021000000000002,0.47745000000000426,0.54020000000000001,0.76910000000000001,0.50520500000000002,0.62327500000000213]
[null,null,null,null,null,null,null,null,null,null,null,176.00000000000199,0.505135,0.62314500000000217,0.47016999999999998,0.47719000000000433,0.54010000000000002,0.76910000000000001,0.505135,0.62314500000000217]
[null,null,null,null,null,null,null,null,null,null,null,176.10000000000201,0.50506499999999999,0.62301500000000221,0.47002999999999995,0.47693000000000441,0.54010000000000002,0.76910000000000001,0.50506499999999999,0.62301500000000221]
[null,null,null,null,null,null,null,null,null,null,null,176.20000000000201,0.50499499999999997,0.62288500000000224,0.46998999999999991,0.47667000000000448,0.54,0.76910000000000001,0.50499499999999997,0.62288500000000224]
[null,null,null,null,null,null,null,null,null,null,null,176.300000000002,0.50492499999999996,0.62275500000000228,0.46984999999999988,0.47641000000000455,0.54,0.76910000000000001,0.50492499999999996,0.62275500000000228]
[null,null,null,null,null,null,null,null,null,null,null,176.400000000002,0.50485500000000005,0.62262500000000232,0.46981000000000006,0.47615000000000463,0.53990000000000005,0.76910000000000001,0.50485500000000005,0.62262500000000232]
[null,null,null,null,null,null,null,null,null,null,null,176.50000000000301,0.50478500000000004,0.62249500000000235,0.46967000000000003,0.4758900000000047,0.53990000000000005,0.76910000000000001,0.50478500000000004,0.62249500000000235]
[null,null,null,null,null,null,null,null,null,null,null,176.60000000000201,0.50471500000000002,0.62236500000000239,0.4696300000000001,0.47563000000000477,0.53979999999999995,0.76910000000000001,0.50471500000000002,0.62236500000000239]
[null,null,null,null,null,null,null,null,null,null,null,176.70000000000201,0.50464500000000001,0.62223500000000243,0.46949000000000007,0.47537000000000484,0.53979999999999995,0.76910000000000001,0.50464500000000001,0.62223500000000243]
[null,null,null,null,null,null,null,null,null,null,null,176.800000000002,0.504575,0.62210500000000246,0.46945000000000003,0.47511000000000492,0.53969999999999996,0.76910000000000001,0.504575,0.62210500000000246]
[null,null,null,null,null,null,null,null,null,null,null,176.900000000002,0.50450499999999998,0.6219750000000025,0.46931,0.47485000000000499,0.53969999999999996,0.76910000000000001,0.50450499999999998,0.6219750000000025]
[null,null,null,null,null,null,null,null,null,null,null,177.00000000000301,0.50443499999999997,0.62184500000000253,0.46926999999999996,0.47459000000000506,0.53959999999999997,0.76910000000000001,0.50443499999999997,0.62184500000000253]
[null,null,null,null,null,null,null,null,null,null,null,177.10000000000301,0.50436499999999995,0.62171500000000257,0.46912999999999994,0.47433000000000514,0.53959999999999997,0.76910000000000001,0.50436499999999995,0.62171500000000257]
[null,null,null,null,null,null,null,null,null,null,null,177.200000000003,0.50429500000000005,0.62158500000000261,0.46909000000000012,0.47407000000000521,0.53949999999999998,0.76910000000000001,0.50429500000000005,0.62158500000000261]
[null,null,null,null,null,null,null,null,null,null,null,177.300000000003,0.50422500000000003,0.62145500000000264,0.46895000000000009,0.47381000000000528,0.53949999999999998,0.76910000000000001,0.50422500000000003,0.62145500000000264]
[null,null,null,null,null,null,null,null,null,null,null,177.40000000000299,0.50415500000000002,0.62132500000000268,0.46891000000000005,0.47355000000000536,0.53939999999999999,0.76910000000000001,0.50415500000000002,0.62132500000000268]
[null,null,null,null,null,null,null,null,null,null,null,177.50000000000301,0.50408500000000001,0.62119500000000272,0.46877000000000002,0.47329000000000543,0.53939999999999999,0.76910000000000001,0.50408500000000001,0.62119500000000272]
[null,null,null,null,null,null,null,null,null,null,null,177.60000000000301,0.50401499999999999,0.62106500000000275,0.46872999999999998,0.4730300000000055,0.5393,0.76910000000000001,0.50401499999999999,0.62106500000000275]
[null,null,null,null,null,null,null,null,null,null,null,177.700000000003,0.50394499999999998,0.62093500000000279,0.46858999999999995,0.47277000000000557,0.5393,0.76910000000000001,0.50394499999999998,0.62093500000000279]
[null,null,null,null,null,null,null,null,null,null,null,177.800000000003,0.50387499999999996,0.62080500000000283,0.46854999999999991,0.47251000000000565,0.53920000000000001,0.76910000000000001,0.50387499999999996,0.62080500000000283]
[null,null,null,null,null,null,null,null,null,null,null,177.90000000000299,0.50380499999999995,0.62067500000000286,0.46840999999999988,0.47225000000000572,0.53920000000000001,0.76910000000000001,0.50380499999999995,0.62067500000000286]
[null,null,null,null,null,null,null,null,null,null,null,178.00000000000301,0.50373500000000004,0.6205450000000029,0.46837000000000006,0.47199000000000579,0.53910000000000002,0.76910000000000001,0.50373500000000004,0.6205450000000029]
[null,null,null,null,null,null,null,null,null,null,null,178.10000000000301,0.50366500000000003,0.62041500000000294,0.46823000000000004,0.47173000000000587,0.53910000000000002,0.76910000000000001,0.50366500000000003,0.62041500000000294]
[null,null,null,null,null,null,null,null,null,null,null,178.200000000003,0.50359500000000001,0.62028500000000297,0.46819,0.47147000000000594,0.53900000000000003,0.76910000000000001,0.50359500000000001,0.62028500000000297]
[null,null,null,null,null,null,null,null,null,null,null,178.300000000003,0.503525,0.62015500000000301,0.46804999999999997,0.47121000000000601,0.53900000000000003,0.76910000000000001,0.503525,0.62015500000000301]
[null,null,null,null,null,null,null,null,null,null,null,178.40000000000299,0.50345499999999999,0.62002500000000305,0.46800999999999993,0.47095000000000609,0.53890000000000005,0.76910000000000001,0.50345499999999999,0.62002500000000305]
[null,null,null,null,null,null,null,null,null,null,null,178.50000000000301,0.50338499999999997,0.61989500000000308,0.4678699999999999,0.47069000000000616,0.53890000000000005,0.76910000000000001,0.50338499999999997,0.61989500000000308]
[null,null,null,null,null,null,null,null,null,null,null,178.60000000000301,0.50327999999999995,0.61976500000000312,0.46775999999999995,0.47043000000000623,0.53879999999999995,0.76910000000000001,0.50327999999999995,0.61976500000000312]
[null,null,null,null,null,null,null,null,null,null,null,178.700000000003,0.50321000000000005,0.61963500000000316,0.46762000000000015,0.47017000000000631,0.53879999999999995,0.76910000000000001,0.50321000000000005,0.61963500000000316]
[null,null,null,null,null,null,null,null,null,null,null,178.800000000003,0.50314000000000003,0.61950500000000319,0.46758000000000011,0.46991000000000638,0.53869999999999996,0.76910000000000001,0.50314000000000003,0.61950500000000319]
[null,null,null,null,null,null,null,null,null,null,null,178.90000000000299,0.50307000000000002,0.61937500000000323,0.46744000000000008,0.46965000000000645,0.53869999999999996,0.76910000000000001,0.50307000000000002,0.61937500000000323]
[null,null,null,null,null,null,null,null,null,null,null,179.00000000000301,0.503,0.61924500000000327,0.46730000000000005,0.46939000000000652,0.53869999999999996,0.76910000000000001,0.503,0.61924500000000327]
[null,null,null,null,null,null,null,null,null,null,null,179.10000000000301,0.50292999999999999,0.6191150000000033,0.46726000000000001,0.4691300000000066,0.53859999999999997,0.76910000000000001,0.50292999999999999,0.6191150000000033]
[null,null,null,null,null,null,null,null,null,null,null,179.200000000003,0.50285999999999997,0.61898500000000334,0.46711999999999998,0.46887000000000667,0.53859999999999997,0.76910000000000001,0.50285999999999997,0.61898500000000334]
[null,null,null,null,null,null,null,null,null,null,null,179.300000000003,0.50278999999999996,0.61885500000000337,0.46707999999999994,0.46861000000000674,0.53849999999999998,0.76910000000000001,0.50278999999999996,0.61885500000000337]
[null,null,null,null,null,null,null,null,null,null,null,179.40000000000299,0.50271999999999994,0.61872500000000341,0.46693999999999991,0.46835000000000682,0.53849999999999998,0.76910000000000001,0.50271999999999994,0.61872500000000341]
[null,null,null,null,null,null,null,null,null,null,null,179.50000000000301,0.50265000000000004,0.61859500000000345,0.46690000000000009,0.46809000000000689,0.53839999999999999,0.76910000000000001,0.50265000000000004,0.61859500000000345]
[null,null,null,null,null,null,null,null,null,null,null,179.60000000000301,0.50258000000000003,0.61846500000000348,0.46676000000000006,0.46783000000000696,0.53839999999999999,0.76910000000000001,0.50258000000000003,0.61846500000000348]
[null,null,null,null,null,null,null,null,null,null,null,179.700000000003,0.50251000000000001,0.61833500000000352,0.46672000000000002,0.46757000000000704,0.5383,0.76910000000000001,0.50251000000000001,0.61833500000000352]
[null,null,null,null,null,null,null,null,null,null,null,179.800000000003,0.50244,0.61820500000000356,0.46657999999999999,0.46731000000000711,0.5383,0.76910000000000001,0.50244,0.61820500000000356]
[null,null,null,null,null,null,null,null,null,null,null,179.90000000000299,0.50236999999999998,0.61807500000000359,0.46653999999999995,0.46705000000000718,0.53820000000000001,0.76910000000000001,0.50236999999999998,0.61807500000000359]
[null,null,null,null,null,null,null,null,null,null,null,180.00000000000301,0.50229999999999997,0.61794500000000363,0.46639999999999993,0.46679000000000725,0.53820000000000001,0.76910000000000001,0.50229999999999997,0.61794500000000363]
[null,null,null,null,null,null,null,null,null,null,null,180.10000000000301,0.50222999999999995,0.61781500000000367,0.46635999999999989,0.46653000000000733,0.53810000000000002,0.76910000000000001,0.50222999999999995,0.61781500000000367]
[null,null,null,null,null,null,null,null,null,null,null,180.200000000003,0.50216000000000005,0.6176850000000037,0.46622000000000008,0.4662700000000074,0.53810000000000002,0.76910000000000001,0.50216000000000005,0.6176850000000037]
[null,null,null,null,null,null,null,null,null,null,null,180.300000000003,0.50209000000000004,0.61755500000000374,0.46618000000000004,0.46601000000000747,0.53800000000000003,0.76910000000000001,0.50209000000000004,0.61755500000000374]
[null,null,null,null,null,null,null,null,null,null,null,180.40000000000299,0.50202000000000002,0.61742500000000378,0.46604000000000001,0.46575000000000755,0.53800000000000003,0.76910000000000001,0.50202000000000002,0.61742500000000378]
[null,null,null,null,null,null,null,null,null,null,null,180.50000000000301,0.50195000000000001,0.61729500000000381,0.46599999999999997,0.46549000000000762,0.53790000000000004,0.76910000000000001,0.50195000000000001,0.61729500000000381]
[null,null,null,null,null,null,null,null,null,null,null,180.60000000000301,0.50187999999999999,0.61716500000000385,0.46585999999999994,0.46523000000000769,0.53790000000000004,0.76910000000000001,0.50187999999999999,0.61716500000000385]
[null,null,null,null,null,null,null,null,null,null,null,180.700000000003,0.50180999999999998,0.61703500000000389,0.46582000000000001,0.46497000000000777,0.53779999999999994,0.76910000000000001,0.50180999999999998,0.61703500000000389]
[null,null,null,null,null,null,null,null,null,null,null,180.800000000003,0.50173999999999996,0.61690500000000392,0.46567999999999998,0.46471000000000784,0.53779999999999994,0.76910000000000001,0.50173999999999996,0.61690500000000392]
[null,null,null,null,null,null,null,null,null,null,null,180.90000000000401,0.50166999999999995,0.61677500000000396,0.46563999999999994,0.46445000000000791,0.53769999999999996,0.76910000000000001,0.50166999999999995,0.61677500000000396]
[null,null,null,null,null,null,null,null,null,null,null,181.00000000000301,0.50160000000000005,0.616645000000004,0.46550000000000014,0.46419000000000799,0.53769999999999996,0.76910000000000001,0.50160000000000005,0.616645000000004]
[null,null,null,null,null,null,null,null,null,null,null,181.10000000000301,0.50153000000000003,0.61651500000000403,0.46536000000000011,0.46393000000000806,0.53769999999999996,0.76910000000000001,0.50153000000000003,0.61651500000000403]
[null,null,null,null,null,null,null,null,null,null,null,181.200000000003,0.50146000000000002,0.61638500000000407,0.46532000000000007,0.46367000000000813,0.53759999999999997,0.76910000000000001,0.50146000000000002,0.61638500000000407]
[null,null,null,null,null,null,null,null,null,null,null,181.300000000003,0.50139,0.61625500000000411,0.46518000000000004,0.4634100000000082,0.53759999999999997,0.76910000000000001,0.50139,0.61625500000000411]
[null,null,null,null,null,null,null,null,null,null,null,181.40000000000401,0.50131999999999999,0.61612500000000414,0.46514,0.46315000000000828,0.53749999999999998,0.76910000000000001,0.50131999999999999,0.61612500000000414]
[null,null,null,null,null,null,null,null,null,null,null,181.50000000000401,0.50124999999999997,0.61599500000000418,0.46500000000000002,0.46289000000000835,0.53749999999999998,0.76910000000000001,0.50124999999999997,0.61599500000000418]
[null,null,null,null,null,null,null,null,null,null,null,181.600000000004,0.50117999999999996,0.61586500000000421,0.46495999999999993,0.46263000000000842,0.53739999999999999,0.76910000000000001,0.50117999999999996,0.61586500000000421]
[null,null,null,null,null,null,null,null,null,null,null,181.700000000004,0.50111000000000006,0.61573500000000425,0.46482000000000012,0.4623700000000085,0.53739999999999999,0.76910000000000001,0.50111000000000006,0.61573500000000425]
[null,null,null,null,null,null,null,null,null,null,null,181.80000000000399,0.50104000000000004,0.61560500000000429,0.46478000000000008,0.46211000000000857,0.5373,0.76910000000000001,0.50104000000000004,0.61560500000000429]
[null,null,null,null,null,null,null,null,null,null,null,181.90000000000401,0.50097000000000003,0.61547500000000432,0.46464000000000005,0.46185000000000864,0.5373,0.76910000000000001,0.50097000000000003,0.61547500000000432]
[null,null,null,null,null,null,null,null,null,null,null,182.00000000000401,0.50090000000000001,0.61534500000000436,0.46460000000000001,0.46159000000000872,0.53720000000000001,0.76910000000000001,0.50090000000000001,0.61534500000000436]
[null,null,null,null,null,null,null,null,null,null,null,182.100000000004,0.50083,0.6152150000000044,0.46445999999999998,0.46133000000000879,0.53720000000000001,0.76910000000000001,0.50083,0.6152150000000044]
[null,null,null,null,null,null,null,null,null,null,null,182.200000000004,0.50075999999999998,0.61508500000000443,0.46441999999999994,0.46107000000000886,0.53710000000000002,0.76910000000000001,0.50075999999999998,0.61508500000000443]
[null,null,null,null,null,null,null,null,null,null,null,182.30000000000399,0.50068999999999997,0.61495500000000447,0.46427999999999991,0.46081000000000893,0.53710000000000002,0.76910000000000001,0.50068999999999997,0.61495500000000447]
[null,null,null,null,null,null,null,null,null,null,null,182.40000000000401,0.50061999999999995,0.61482500000000451,0.46413999999999989,0.46055000000000901,0.53710000000000002,0.76910000000000001,0.50061999999999995,0.61482500000000451]
[null,null,null,null,null,null,null,null,null,null,null,182.50000000000401,0.50055000000000005,0.61469500000000454,0.46410000000000007,0.46029000000000908,0.53700000000000003,0.76910000000000001,0.50055000000000005,0.61469500000000454]
[null,null,null,null,null,null,null,null,null,null,null,182.600000000004,0.50048499999999996,0.61456500000000458,0.46396999999999988,0.46003000000000915,0.53700000000000003,0.76910000000000001,0.50048499999999996,0.61456500000000458]
[null,null,null,null,null,null,null,null,null,null,null,182.700000000004,0.50041999999999998,0.61443500000000462,0.46393999999999991,0.45977000000000923,0.53690000000000004,0.76910000000000001,0.50041999999999998,0.61443500000000462]
[null,null,null,null,null,null,null,null,null,null,null,182.80000000000399,0.50034999999999996,0.61430500000000465,0.46379999999999988,0.4595100000000093,0.53690000000000004,0.76910000000000001,0.50034999999999996,0.61430500000000465]
[null,null,null,null,null,null,null,null,null,null,null,182.90000000000401,0.50027999999999995,0.61417500000000469,0.46375999999999984,0.45925000000000937,0.53680000000000005,0.76910000000000001,0.50027999999999995,0.61417500000000469]
[null,null,null,null,null,null,null,null,null,null,null,183.00000000000401,0.50021000000000004,0.61404500000000473,0.46362000000000003,0.45899000000000945,0.53680000000000005,0.76910000000000001,0.50021000000000004,0.61404500000000473]
[null,null,null,null,null,null,null,null,null,null,null,183.100000000004,0.50014000000000003,0.61391500000000476,0.4635800000000001,0.45873000000000952,0.53669999999999995,0.76910000000000001,0.50014000000000003,0.61391500000000476]
[null,null,null,null,null,null,null,null,null,null,null,183.200000000004,0.50007000000000001,0.6137850000000048,0.46344000000000007,0.45847000000000959,0.53669999999999995,0.76910000000000001,0.50007000000000001,0.6137850000000048]
[null,null,null,null,null,null,null,null,null,null,null,183.30000000000399,0.5,0.61365500000000484,0.46340000000000003,0.45821000000000967,0.53659999999999997,0.76910000000000001,0.5,0.61365500000000484]
[null,null,null,null,null,null,null,null,null,null,null,183.40000000000401,0.49992999999999999,0.61352500000000487,0.46326000000000001,0.45795000000000974,0.53659999999999997,0.76910000000000001,0.49992999999999999,0.61352500000000487]
[null,null,null,null,null,null,null,null,null,null,null,183.50000000000401,0.49986000000000003,0.61339500000000491,0.46312000000000009,0.45769000000000981,0.53659999999999997,0.76910000000000001,0.49986000000000003,0.61339500000000491]
[null,null,null,null,null,null,null,null,null,null,null,183.600000000004,0.49979000000000001,0.61326500000000495,0.46308000000000005,0.45743000000000988,0.53649999999999998,0.76910000000000001,0.49979000000000001,0.61326500000000495]
[null,null,null,null,null,null,null,null,null,null,null,183.700000000004,0.49972,0.61313500000000498,0.46294000000000002,0.45717000000000996,0.53649999999999998,0.76910000000000001,0.49972,0.61313500000000498]
[null,null,null,null,null,null,null,null,null,null,null,183.80000000000399,0.49964999999999998,0.61300500000000502,0.46289999999999998,0.45691000000001003,0.53639999999999999,0.76910000000000001,0.49964999999999998,0.61300500000000502]
[null,null,null,null,null,null,null,null,null,null,null,183.90000000000401,0.49958000000000002,0.61287500000000505,0.46276000000000006,0.4566500000000101,0.53639999999999999,0.76910000000000001,0.49958000000000002,0.61287500000000505]
[null,null,null,null,null,null,null,null,null,null,null,184.00000000000401,0.49951000000000001,0.61274500000000509,0.46272000000000002,0.45639000000001018,0.5363,0.76910000000000001,0.49951000000000001,0.61274500000000509]
[null,null,null,null,null,null,null,null,null,null,null,184.100000000004,0.49944,0.61261500000000513,0.46257999999999999,0.45613000000001025,0.5363,0.76910000000000001,0.49944,0.61261500000000513]
[null,null,null,null,null,null,null,null,null,null,null,184.200000000004,0.49936999999999998,0.61248500000000516,0.46253999999999995,0.45587000000001032,0.53620000000000001,0.76910000000000001,0.49936999999999998,0.61248500000000516]
[null,null,null,null,null,null,null,null,null,null,null,184.30000000000399,0.49930000000000002,0.6123550000000052,0.46240000000000003,0.4556100000000104,0.53620000000000001,0.76910000000000001,0.49930000000000002,0.6123550000000052]
[null,null,null,null,null,null,null,null,null,null,null,184.40000000000401,0.49923000000000001,0.61222500000000524,0.46226,0.45535000000001047,0.53620000000000001,0.76910000000000001,0.49923000000000001,0.61222500000000524]
[null,null,null,null,null,null,null,null,null,null,null,184.50000000000401,0.49915999999999999,0.61209500000000527,0.46221999999999996,0.45509000000001054,0.53610000000000002,0.76910000000000001,0.49915999999999999,0.61209500000000527]
[null,null,null,null,null,null,null,null,null,null,null,184.600000000004,0.49908999999999998,0.61196500000000531,0.46207999999999994,0.45483000000001061,0.53610000000000002,0.76910000000000001,0.49908999999999998,0.61196500000000531]
[null,null,null,null,null,null,null,null,null,null,null,184.700000000004,0.49902000000000002,0.61183500000000535,0.46204000000000001,0.45457000000001069,0.53600000000000003,0.76910000000000001,0.49902000000000002,0.61183500000000535]
[null,null,null,null,null,null,null,null,null,null,null,184.80000000000399,0.49895,0.61170500000000538,0.46189999999999998,0.45431000000001076,0.53600000000000003,0.76910000000000001,0.49895,0.61170500000000538]
[null,null,null,null,null,null,null,null,null,null,null,184.90000000000401,0.49890000000000001,0.61157500000000542,0.46189999999999998,0.45405000000001083,0.53590000000000004,0.76910000000000001,0.49890000000000001,0.61157500000000542]
[null,null,null,null,null,null,null,null,null,null,null,185.00000000000401,0.49883499999999997,0.61144500000000546,0.4617699999999999,0.45379000000001091,0.53590000000000004,0.76910000000000001,0.49883499999999997,0.61144500000000546]
[null,null,null,null,null,null,null,null,null,null,null,185.100000000004,0.49877500000000002,0.61131500000000549,0.46165,0.45353000000001098,0.53590000000000004,0.76910000000000001,0.49877500000000002,0.61131500000000549]
[null,null,null,null,null,null,null,null,null,null,null,185.200000000004,0.49871500000000002,0.61118500000000553,0.46162999999999998,0.45327000000001105,0.53580000000000005,0.76910000000000001,0.49871500000000002,0.61118500000000553]
[null,null,null,null,null,null,null,null,null,null,null,185.30000000000501,0.49865500000000001,0.61105500000000557,0.46150999999999998,0.45301000000001113,0.53580000000000005,0.76910000000000001,0.49865500000000001,0.61105500000000557]
[null,null,null,null,null,null,null,null,null,null,null,185.40000000000401,0.49859500000000001,0.6109250000000056,0.46149000000000007,0.4527500000000112,0.53569999999999995,0.76910000000000001,0.49859500000000001,0.6109250000000056]
[null,null,null,null,null,null,null,null,null,null,null,185.50000000000401,0.49853500000000001,0.61079500000000564,0.46137000000000006,0.45249000000001127,0.53569999999999995,0.76910000000000001,0.49853500000000001,0.61079500000000564]
[null,null,null,null,null,null,null,null,null,null,null,185.600000000004,0.498475,0.61066500000000568,0.46135000000000004,0.45223000000001135,0.53559999999999997,0.76910000000000001,0.498475,0.61066500000000568]
[null,null,null,null,null,null,null,null,null,null,null,185.700000000004,0.498415,0.61053500000000571,0.46123000000000003,0.45197000000001142,0.53559999999999997,0.76910000000000001,0.498415,0.61053500000000571]
[null,null,null,null,null,null,null,null,null,null,null,185.80000000000501,0.49835499999999999,0.61040500000000575,0.46111000000000002,0.45171000000001149,0.53559999999999997,0.76910000000000001,0.49835499999999999,0.61040500000000575]
[null,null,null,null,null,null,null,null,null,null,null,185.90000000000501,0.49829499999999999,0.61027500000000579,0.46109,0.45145000000001156,0.53549999999999998,0.76910000000000001,0.49829499999999999,0.61027500000000579]
[null,null,null,null,null,null,null,null,null,null,null,186.000000000005,0.49823499999999998,0.61014500000000582,0.46096999999999999,0.45119000000001164,0.53549999999999998,0.76910000000000001,0.49823499999999998,0.61014500000000582]
[null,null,null,null,null,null,null,null,null,null,null,186.100000000005,0.49817499999999998,0.61001500000000586,0.46094999999999997,0.45093000000001171,0.53539999999999999,0.76910000000000001,0.49817499999999998,0.61001500000000586]
[null,null,null,null,null,null,null,null,null,null,null,186.20000000000499,0.49811499999999997,0.60988500000000589,0.46082999999999996,0.45067000000001178,0.53539999999999999,0.76910000000000001,0.49811499999999997,0.60988500000000589]
[null,null,null,null,null,null,null,null,null,null,null,186.30000000000501,0.49805500000000003,0.60975500000000593,0.46081000000000005,0.45041000000001186,0.5353,0.76910000000000001,0.49805500000000003,0.60975500000000593]
[null,null,null,null,null,null,null,null,null,null,null,186.40000000000501,0.49799500000000002,0.60962500000000597,0.46069000000000004,0.45015000000001193,0.5353,0.76910000000000001,0.49799500000000002,0.60962500000000597]
[null,null,null,null,null,null,null,null,null,null,null,186.500000000005,0.49793500000000002,0.609495000000006,0.46057000000000003,0.449890000000012,0.5353,0.76910000000000001,0.49793500000000002,0.609495000000006]
[null,null,null,null,null,null,null,null,null,null,null,186.600000000005,0.49787500000000001,0.60936500000000604,0.46055000000000001,0.44963000000001208,0.53520000000000001,0.76910000000000001,0.49787500000000001,0.60936500000000604]
[null,null,null,null,null,null,null,null,null,null,null,186.70000000000499,0.49781500000000001,0.60923500000000608,0.46043000000000001,0.44937000000001215,0.53520000000000001,0.76910000000000001,0.49781500000000001,0.60923500000000608]
[null,null,null,null,null,null,null,null,null,null,null,186.80000000000501,0.497755,0.60910500000000611,0.46040999999999999,0.44911000000001222,0.53510000000000002,0.76910000000000001,0.497755,0.60910500000000611]
[null,null,null,null,null,null,null,null,null,null,null,186.90000000000501,0.497695,0.60897500000000615,0.46028999999999998,0.44885000000001229,0.53510000000000002,0.76910000000000001,0.497695,0.60897500000000615]
[null,null,null,null,null,null,null,null,null,null,null,187.000000000005,0.49763499999999999,0.60884500000000619,0.46016999999999997,0.44859000000001237,0.53510000000000002,0.76910000000000001,0.49763499999999999,0.60884500000000619]
[null,null,null,null,null,null,null,null,null,null,null,187.100000000005,0.49757499999999999,0.60871500000000622,0.46014999999999995,0.44833000000001244,0.53500000000000003,0.76910000000000001,0.49757499999999999,0.60871500000000622]
[null,null,null,null,null,null,null,null,null,null,null,187.20000000000499,0.49751499999999999,0.60858500000000626,0.46002999999999994,0.44807000000001251,0.53500000000000003,0.76910000000000001,0.49751499999999999,0.60858500000000626]
[null,null,null,null,null,null,null,null,null,null,null,187.30000000000501,0.49745499999999998,0.6084550000000063,0.46000999999999992,0.44781000000001259,0.53490000000000004,0.76910000000000001,0.49745499999999998,0.6084550000000063]
[null,null,null,null,null,null,null,null,null,null,null,187.40000000000501,0.49739499999999998,0.60832500000000633,0.45988999999999991,0.44755000000001266,0.53490000000000004,0.76910000000000001,0.49739499999999998,0.60832500000000633]
[null,null,null,null,null,null,null,null,null,null,null,187.500000000005,0.49733500000000003,0.60819500000000637,0.45977000000000001,0.44729000000001273,0.53490000000000004,0.76910000000000001,0.49733500000000003,0.60819500000000637]
[null,null,null,null,null,null,null,null,null,null,null,187.600000000005,0.49727500000000002,0.60806500000000641,0.45974999999999999,0.44703000000001281,0.53480000000000005,0.76910000000000001,0.49727500000000002,0.60806500000000641]
[null,null,null,null,null,null,null,null,null,null,null,187.70000000000499,0.49721500000000002,0.60793500000000644,0.45962999999999998,0.44677000000001288,0.53480000000000005,0.76910000000000001,0.49721500000000002,0.60793500000000644]
[null,null,null,null,null,null,null,null,null,null,null,187.80000000000501,0.49715500000000001,0.60780500000000648,0.45961000000000007,0.44651000000001295,0.53469999999999995,0.76910000000000001,0.49715500000000001,0.60780500000000648]
[null,null,null,null,null,null,null,null,null,null,null,187.90000000000501,0.49709500000000001,0.60767500000000652,0.45949000000000007,0.44625000000001303,0.53469999999999995,0.76910000000000001,0.49709500000000001,0.60767500000000652]
[null,null,null,null,null,null,null,null,null,null,null,188.000000000005,0.497035,0.60754500000000655,0.45937000000000006,0.4459900000000131,0.53469999999999995,0.76910000000000001,0.497035,0.60754500000000655]
[null,null,null,null,null,null,null,null,null,null,null,188.100000000005,0.496975,0.60741500000000659,0.45935000000000004,0.44573000000001317,0.53459999999999996,0.76910000000000001,0.496975,0.60741500000000659]
[null,null,null,null,null,null,null,null,null,null,null,188.20000000000499,0.496915,0.60728500000000663,0.45923000000000003,0.44547000000001324,0.53459999999999996,0.76910000000000001,0.496915,0.60728500000000663]
[null,null,null,null,null,null,null,null,null,null,null,188.30000000000501,0.49685499999999999,0.60715500000000666,0.45921000000000001,0.44521000000001332,0.53449999999999998,0.76910000000000001,0.49685499999999999,0.60715500000000666]
[null,null,null,null,null,null,null,null,null,null,null,188.40000000000501,0.49679499999999999,0.6070250000000067,0.45909,0.44495000000001339,0.53449999999999998,0.76910000000000001,0.49679499999999999,0.6070250000000067]
[null,null,null,null,null,null,null,null,null,null,null,188.500000000005,0.49673499999999998,0.60689500000000673,0.45896999999999999,0.44469000000001346,0.53449999999999998,0.76910000000000001,0.49673499999999998,0.60689500000000673]
[null,null,null,null,null,null,null,null,null,null,null,188.600000000005,0.49667499999999998,0.60676500000000677,0.45894999999999997,0.44443000000001354,0.53439999999999999,0.76910000000000001,0.49667499999999998,0.60676500000000677]
[null,null,null,null,null,null,null,null,null,null,null,188.70000000000499,0.49661499999999997,0.60663500000000681,0.45882999999999996,0.44417000000001361,0.53439999999999999,0.76910000000000001,0.49661499999999997,0.60663500000000681]
[null,null,null,null,null,null,null,null,null,null,null,188.80000000000501,0.49655500000000002,0.60650500000000684,0.45871000000000006,0.44391000000001368,0.53439999999999999,0.76910000000000001,0.49655500000000002,0.60650500000000684]
[null,null,null,null,null,null,null,null,null,null,null,188.90000000000501,0.49649500000000002,0.60637500000000688,0.45869000000000004,0.44365000000001376,0.5343,0.76910000000000001,0.49649500000000002,0.60637500000000688]
[null,null,null,null,null,null,null,null,null,null,null,189.000000000005,0.496415,0.60624500000000692,0.45852999999999999,0.44339000000001383,0.5343,0.76910000000000001,0.496415,0.60624500000000692]
[null,null,null,null,null,null,null,null,null,null,null,189.100000000005,0.49635499999999999,0.60611500000000695,0.45850999999999997,0.4431300000000139,0.53420000000000001,0.76910000000000001,0.49635499999999999,0.60611500000000695]
[null,null,null,null,null,null,null,null,null,null,null,189.20000000000499,0.49629499999999999,0.60598500000000699,0.45838999999999996,0.44287000000001397,0.53420000000000001,0.76910000000000001,0.49629499999999999,0.60598500000000699]
[null,null,null,null,null,null,null,null,null,null,null,189.30000000000501,0.49623499999999998,0.60585500000000703,0.45826999999999996,0.44261000000001405,0.53420000000000001,0.76910000000000001,0.49623499999999998,0.60585500000000703]
[null,null,null,null,null,null,null,null,null,null,null,189.40000000000501,0.49617499999999998,0.60572500000000706,0.45824999999999994,0.44235000000001412,0.53410000000000002,0.76910000000000001,0.49617499999999998,0.60572500000000706]
[null,null,null,null,null,null,null,null,null,null,null,189.500000000005,0.49611499999999997,0.6055950000000071,0.45812999999999993,0.44209000000001419,0.53410000000000002,0.76910000000000001,0.49611499999999997,0.6055950000000071]
[null,null,null,null,null,null,null,null,null,null,null,189.600000000005,0.49605500000000002,0.60546500000000714,0.45801000000000003,0.44183000000001427,0.53410000000000002,0.76910000000000001,0.49605500000000002,0.60546500000000714]
[null,null,null,null,null,null,null,null,null,null,null,189.70000000000601,0.49599500000000002,0.60533500000000717,0.45799000000000001,0.44157000000001434,0.53400000000000003,0.76910000000000001,0.49599500000000002,0.60533500000000717]
[null,null,null,null,null,null,null,null,null,null,null,189.80000000000501,0.49593500000000001,0.60520500000000721,0.45787,0.44131000000001441,0.53400000000000003,0.76910000000000001,0.49593500000000001,0.60520500000000721]
[null,null,null,null,null,null,null,null,null,null,null,189.90000000000501,0.49587500000000001,0.60507500000000725,0.45774999999999999,0.44105000000001449,0.53400000000000003,0.76910000000000001,0.49587500000000001,0.60507500000000725]
[null,null,null,null,null,null,null,null,null,null,null,190.000000000005,0.49581500000000001,0.60494500000000728,0.45772999999999997,0.44079000000001456,0.53390000000000004,0.76910000000000001,0.49581500000000001,0.60494500000000728]
[null,null,null,null,null,null,null,null,null,null,null,190.100000000005,0.495755,0.60481500000000732,0.45760999999999996,0.44053000000001463,0.53390000000000004,0.76910000000000001,0.495755,0.60481500000000732]
[null,null,null,null,null,null,null,null,null,null,null,190.20000000000601,0.495695,0.60468500000000736,0.45758999999999994,0.44027000000001471,0.53380000000000005,0.76910000000000001,0.495695,0.60468500000000736]
[null,null,null,null,null,null,null,null,null,null,null,190.30000000000601,0.49563499999999999,0.60455500000000739,0.45746999999999993,0.44001000000001478,0.53380000000000005,0.76910000000000001,0.49563499999999999,0.60455500000000739]
[null,null,null,null,null,null,null,null,null,null,null,190.400000000006,0.49557499999999999,0.60442500000000743,0.45734999999999992,0.43975000000001485,0.53380000000000005,0.76910000000000001,0.49557499999999999,0.60442500000000743]
[null,null,null,null,null,null,null,null,null,null,null,190.500000000006,0.49551499999999998,0.60429500000000747,0.45733000000000001,0.43949000000001492,0.53369999999999995,0.76910000000000001,0.49551499999999998,0.60429500000000747]
[null,null,null,null,null,null,null,null,null,null,null,190.60000000000599,0.49545499999999998,0.6041650000000075,0.45721000000000001,0.439230000000015,0.53369999999999995,0.76910000000000001,0.49545499999999998,0.6041650000000075]
[null,null,null,null,null,null,null,null,null,null,null,190.70000000000601,0.49539499999999997,0.60403500000000754,0.45709,0.43897000000001507,0.53369999999999995,0.76910000000000001,0.49539499999999997,0.60403500000000754]
[null,null,null,null,null,null,null,null,null,null,null,190.80000000000601,0.49533500000000003,0.60390500000000757,0.45707000000000009,0.43871000000001514,0.53359999999999996,0.76910000000000001,0.49533500000000003,0.60390500000000757]
[null,null,null,null,null,null,null,null,null,null,null,190.900000000006,0.49527500000000002,0.60377500000000761,0.45695000000000008,0.43845000000001522,0.53359999999999996,0.76910000000000001,0.49527500000000002,0.60377500000000761]
[null,null,null,null,null,null,null,null,null,null,null,191.000000000006,0.49521500000000002,0.60364500000000765,0.45683000000000007,0.43819000000001529,0.53359999999999996,0.76910000000000001,0.49521500000000002,0.60364500000000765]
[null,null,null,null,null,null,null,null,null,null,null,191.10000000000599,0.49515500000000001,0.60351500000000768,0.45681000000000005,0.43793000000001536,0.53349999999999997,0.76910000000000001,0.49515500000000001,0.60351500000000768]
[null,null,null,null,null,null,null,null,null,null,null,191.20000000000601,0.49509500000000001,0.60338500000000772,0.45669000000000004,0.43767000000001544,0.53349999999999997,0.76910000000000001,0.49509500000000001,0.60338500000000772]
[null,null,null,null,null,null,null,null,null,null,null,191.30000000000601,0.495035,0.60325500000000776,0.45657000000000003,0.43741000000001551,0.53349999999999997,0.76910000000000001,0.495035,0.60325500000000776]
[null,null,null,null,null,null,null,null,null,null,null,191.400000000006,0.494975,0.60312500000000779,0.45655000000000001,0.43715000000001558,0.53339999999999999,0.76910000000000001,0.494975,0.60312500000000779]
[null,null,null,null,null,null,null,null,null,null,null,191.500000000006,0.49491499999999999,0.60299500000000783,0.45643,0.43689000000001565,0.53339999999999999,0.76910000000000001,0.49491499999999999,0.60299500000000783]
[null,null,null,null,null,null,null,null,null,null,null,191.60000000000599,0.49485499999999999,0.60286500000000787,0.45630999999999999,0.43663000000001573,0.53339999999999999,0.76910000000000001,0.49485499999999999,0.60286500000000787]
[null,null,null,null,null,null,null,null,null,null,null,191.70000000000601,0.49479499999999998,0.6027350000000079,0.45628999999999997,0.4363700000000158,0.5333,0.76910000000000001,0.49479499999999998,0.6027350000000079]
[null,null,null,null,null,null,null,null,null,null,null,191.80000000000601,0.49473499999999998,0.60260500000000794,0.45616999999999996,0.43611000000001587,0.5333,0.76910000000000001,0.49473499999999998,0.60260500000000794]
[null,null,null,null,null,null,null,null,null,null,null,191.900000000006,0.49467499999999998,0.60247500000000798,0.45604999999999996,0.43585000000001595,0.5333,0.76910000000000001,0.49467499999999998,0.60247500000000798]
[null,null,null,null,null,null,null,null,null,null,null,192.000000000006,0.49461500000000003,0.60234500000000801,0.45603000000000005,0.43559000000001602,0.53320000000000001,0.76910000000000001,0.49461500000000003,0.60234500000000801]
[null,null,null,null,null,null,null,null,null,null,null,192.10000000000599,0.49455500000000002,0.60221500000000805,0.45591000000000004,0.43533000000001609,0.53320000000000001,0.76910000000000001,0.49455500000000002,0.60221500000000805]
[null,null,null,null,null,null,null,null,null,null,null,192.20000000000601,0.49449500000000002,0.60208500000000809,0.45579000000000003,0.43507000000001617,0.53320000000000001,0.76910000000000001,0.49449500000000002,0.60208500000000809]
[null,null,null,null,null,null,null,null,null,null,null,192.30000000000601,0.49441499999999999,0.60195500000000812,0.45562999999999998,0.43481000000001624,0.53320000000000001,0.76910000000000001,0.49441499999999999,0.60195500000000812]
[null,null,null,null,null,null,null,null,null,null,null,192.400000000006,0.49435499999999999,0.60182500000000816,0.45560999999999996,0.43455000000001631,0.53310000000000002,0.76910000000000001,0.49435499999999999,0.60182500000000816]
[null,null,null,null,null,null,null,null,null,null,null,192.500000000006,0.49429499999999998,0.6016950000000082,0.45548999999999995,0.43429000000001639,0.53310000000000002,0.76910000000000001,0.49429499999999998,0.6016950000000082]
[null,null,null,null,null,null,null,null,null,null,null,192.60000000000599,0.49423499999999998,0.60156500000000823,0.45536999999999994,0.43403000000001646,0.53310000000000002,0.76910000000000001,0.49423499999999998,0.60156500000000823]
[null,null,null,null,null,null,null,null,null,null,null,192.70000000000601,0.49417499999999998,0.60143500000000827,0.45534999999999992,0.43377000000001653,0.53300000000000003,0.76910000000000001,0.49417499999999998,0.60143500000000827]
[null,null,null,null,null,null,null,null,null,null,null,192.80000000000601,0.49411500000000003,0.60130500000000831,0.45523000000000002,0.4335100000000166,0.53300000000000003,0.76910000000000001,0.49411500000000003,0.60130500000000831]
[null,null,null,null,null,null,null,null,null,null,null,192.900000000006,0.49405500000000002,0.60117500000000834,0.45511000000000001,0.43325000000001668,0.53300000000000003,0.76910000000000001,0.49405500000000002,0.60117500000000834]
[null,null,null,null,null,null,null,null,null,null,null,193.000000000006,0.49399500000000002,0.60104500000000838,0.45508999999999999,0.43299000000001675,0.53290000000000004,0.76910000000000001,0.49399500000000002,0.60104500000000838]
[null,null,null,null,null,null,null,null,null,null,null,193.10000000000599,0.49393500000000001,0.60091500000000841,0.45496999999999999,0.43273000000001682,0.53290000000000004,0.76910000000000001,0.49393500000000001,0.60091500000000841]
[null,null,null,null,null,null,null,null,null,null,null,193.20000000000601,0.49387500000000001,0.60078500000000845,0.45484999999999998,0.4324700000000169,0.53290000000000004,0.76910000000000001,0.49387500000000001,0.60078500000000845]
[null,null,null,null,null,null,null,null,null,null,null,193.30000000000601,0.493815,0.60065500000000849,0.45472999999999997,0.43221000000001697,0.53290000000000004,0.76910000000000001,0.493815,0.60065500000000849]
[null,null,null,null,null,null,null,null,null,null,null,193.400000000006,0.493755,0.60052500000000852,0.45470999999999995,0.43195000000001704,0.53280000000000005,0.76910000000000001,0.493755,0.60052500000000852]
[null,null,null,null,null,null,null,null,null,null,null,193.500000000006,0.49369499999999999,0.60039500000000856,0.45458999999999994,0.43169000000001712,0.53280000000000005,0.76910000000000001,0.49369499999999999,0.60039500000000856]
[null,null,null,null,null,null,null,null,null,null,null,193.60000000000599,0.49363499999999999,0.6002650000000086,0.45446999999999993,0.43143000000001719,0.53280000000000005,0.76910000000000001,0.49363499999999999,0.6002650000000086]
[null,null,null,null,null,null,null,null,null,null,null,193.70000000000601,0.49357499999999999,0.60013500000000863,0.45445000000000002,0.43117000000001726,0.53269999999999995,0.76910000000000001,0.49357499999999999,0.60013500000000863]
[null,null,null,null,null,null,null,null,null,null,null,193.80000000000601,0.49351499999999998,0.60000500000000867,0.45433000000000001,0.43091000000001733,0.53269999999999995,0.76910000000000001,0.49351499999999998,0.60000500000000867]
[null,null,null,null,null,null,null,null,null,null,null,193.900000000006,0.49345499999999998,0.59987500000000871,0.45421,0.43065000000001741,0.53269999999999995,0.76910000000000001,0.49345499999999998,0.59987500000000871]
[null,null,null,null,null,null,null,null,null,null,null,194.000000000006,0.49339499999999997,0.59974500000000874,0.45408999999999999,0.43039000000001748,0.53269999999999995,0.76910000000000001,0.49339499999999997,0.59974500000000874]
[null,null,null,null,null,null,null,null,null,null,null,194.10000000000699,0.49333500000000002,0.59961500000000878,0.45407000000000008,0.43013000000001755,0.53259999999999996,0.76910000000000001,0.49333500000000002,0.59961500000000878]
[null,null,null,null,null,null,null,null,null,null,null,194.20000000000601,0.49327500000000002,0.59948500000000882,0.45395000000000008,0.42987000000001763,0.53259999999999996,0.76910000000000001,0.49327500000000002,0.59948500000000882]
[null,null,null,null,null,null,null,null,null,null,null,194.30000000000601,0.49321500000000001,0.59935500000000885,0.45383000000000007,0.4296100000000177,0.53259999999999996,0.76910000000000001,0.49321500000000001,0.59935500000000885]
[null,null,null,null,null,null,null,null,null,null,null,194.400000000006,0.49315500000000001,0.59922500000000889,0.45371000000000006,0.42935000000001777,0.53259999999999996,0.76910000000000001,0.49315500000000001,0.59922500000000889]
[null,null,null,null,null,null,null,null,null,null,null,194.500000000006,0.49309500000000001,0.59909500000000893,0.45369000000000004,0.42909000000001785,0.53249999999999997,0.76910000000000001,0.49309500000000001,0.59909500000000893]
[null,null,null,null,null,null,null,null,null,null,null,194.60000000000699,0.493035,0.59896500000000896,0.45357000000000003,0.42883000000001792,0.53249999999999997,0.76910000000000001,0.493035,0.59896500000000896]
[null,null,null,null,null,null,null,null,null,null,null,194.70000000000701,0.492975,0.598835000000009,0.45345000000000002,0.42857000000001799,0.53249999999999997,0.76910000000000001,0.492975,0.598835000000009]
[null,null,null,null,null,null,null,null,null,null,null,194.800000000007,0.49291499999999999,0.59870500000000904,0.45333000000000001,0.42831000000001807,0.53249999999999997,0.76910000000000001,0.49291499999999999,0.59870500000000904]
[null,null,null,null,null,null,null,null,null,null,null,194.900000000007,0.49285499999999999,0.59857500000000907,0.45330999999999999,0.42805000000001814,0.53239999999999998,0.76910000000000001,0.49285499999999999,0.59857500000000907]
[null,null,null,null,null,null,null,null,null,null,null,195.00000000000699,0.49280000000000002,0.59844500000000911,0.45320000000000005,0.42779000000001821,0.53239999999999998,0.76910000000000001,0.49280000000000002,0.59844500000000911]
[null,null,null,null,null,null,null,null,null,null,null,195.10000000000699,0.49275000000000002,0.59831500000000915,0.45310000000000006,0.42753000000001828,0.53239999999999998,0.76910000000000001,0.49275000000000002,0.59831500000000915]
[null,null,null,null,null,null,null,null,null,null,null,195.20000000000701,0.49270000000000003,0.59818500000000918,0.45300000000000007,0.42727000000001836,0.53239999999999998,0.76910000000000001,0.49270000000000003,0.59818500000000918]
[null,null,null,null,null,null,null,null,null,null,null,195.300000000007,0.49264999999999998,0.59805500000000922,0.45299999999999996,0.42701000000001843,0.5323,0.76910000000000001,0.49264999999999998,0.59805500000000922]
[null,null,null,null,null,null,null,null,null,null,null,195.400000000007,0.49259999999999998,0.59792500000000925,0.45289999999999997,0.4267500000000185,0.5323,0.76910000000000001,0.49259999999999998,0.59792500000000925]
[null,null,null,null,null,null,null,null,null,null,null,195.50000000000699,0.49254999999999999,0.59779500000000929,0.45279999999999998,0.42649000000001858,0.5323,0.76910000000000001,0.49254999999999999,0.59779500000000929]
[null,null,null,null,null,null,null,null,null,null,null,195.60000000000699,0.49249999999999999,0.59766500000000933,0.45269999999999999,0.42623000000001865,0.5323,0.76910000000000001,0.49249999999999999,0.59766500000000933]
[null,null,null,null,null,null,null,null,null,null,null,195.70000000000701,0.49245,0.59753500000000936,0.4526,0.42597000000001872,0.5323,0.76910000000000001,0.49245,0.59753500000000936]
[null,null,null,null,null,null,null,null,null,null,null,195.800000000007,0.4924,0.5974050000000094,0.4526,0.4257100000000188,0.53220000000000001,0.76910000000000001,0.4924,0.5974050000000094]
[null,null,null,null,null,null,null,null,null,null,null,195.900000000007,0.49235000000000001,0.59727500000000944,0.45250000000000001,0.42545000000001887,0.53220000000000001,0.76910000000000001,0.49235000000000001,0.59727500000000944]
[null,null,null,null,null,null,null,null,null,null,null,196.00000000000699,0.49230000000000002,0.59714500000000947,0.45240000000000002,0.42519000000001894,0.53220000000000001,0.76910000000000001,0.49230000000000002,0.59714500000000947]
[null,null,null,null,null,null,null,null,null,null,null,196.10000000000699,0.49225000000000002,0.59701500000000951,0.45230000000000004,0.42493000000001901,0.53220000000000001,0.76910000000000001,0.49225000000000002,0.59701500000000951]
[null,null,null,null,null,null,null,null,null,null,null,196.20000000000701,0.49220000000000003,0.59688500000000955,0.45230000000000004,0.42467000000001909,0.53210000000000002,0.76910000000000001,0.49220000000000003,0.59688500000000955]
[null,null,null,null,null,null,null,null,null,null,null,196.300000000007,0.49214999999999998,0.59675500000000958,0.45219999999999994,0.42441000000001916,0.53210000000000002,0.76910000000000001,0.49214999999999998,0.59675500000000958]
[null,null,null,null,null,null,null,null,null,null,null,196.400000000007,0.49209999999999998,0.59662500000000962,0.45209999999999995,0.42415000000001923,0.53210000000000002,0.76910000000000001,0.49209999999999998,0.59662500000000962]
[null,null,null,null,null,null,null,null,null,null,null,196.50000000000699,0.49204999999999999,0.59649500000000966,0.45199999999999996,0.42389000000001931,0.53210000000000002,0.76910000000000001,0.49204999999999999,0.59649500000000966]
[null,null,null,null,null,null,null,null,null,null,null,196.60000000000699,0.49199999999999999,0.59636500000000969,0.45189999999999997,0.42363000000001938,0.53210000000000002,0.76910000000000001,0.49199999999999999,0.59636500000000969]
[null,null,null,null,null,null,null,null,null,null,null,196.70000000000701,0.49195,0.59623500000000973,0.45189999999999997,0.42337000000001945,0.53200000000000003,0.76910000000000001,0.49195,0.59623500000000973]
[null,null,null,null,null,null,null,null,null,null,null,196.800000000007,0.4919,0.59610500000000977,0.45179999999999998,0.42311000000001953,0.53200000000000003,0.76910000000000001,0.4919,0.59610500000000977]
[null,null,null,null,null,null,null,null,null,null,null,196.900000000007,0.49185000000000001,0.5959750000000098,0.45169999999999999,0.4228500000000196,0.53200000000000003,0.76910000000000001,0.49185000000000001,0.5959750000000098]
[null,null,null,null,null,null,null,null,null,null,null,197.00000000000699,0.49180000000000001,0.59584500000000984,0.4516,0.42259000000001967,0.53200000000000003,0.76910000000000001,0.49180000000000001,0.59584500000000984]
[null,null,null,null,null,null,null,null,null,null,null,197.10000000000699,0.49175000000000002,0.59571500000000988,0.45150000000000001,0.42233000000001975,0.53200000000000003,0.76910000000000001,0.49175000000000002,0.59571500000000988]
[null,null,null,null,null,null,null,null,null,null,null,197.20000000000701,0.49170000000000003,0.59558500000000991,0.45140000000000002,0.42207000000001982,0.53200000000000003,0.76910000000000001,0.49170000000000003,0.59558500000000991]
[null,null,null,null,null,null,null,null,null,null,null,197.300000000007,0.49164999999999998,0.59545500000000995,0.45139999999999991,0.42181000000001989,0.53190000000000004,0.76910000000000001,0.49164999999999998,0.59545500000000995]
[null,null,null,null,null,null,null,null,null,null,null,197.400000000007,0.49159999999999998,0.59532500000000999,0.45129999999999992,0.42155000000001996,0.53190000000000004,0.76910000000000001,0.49159999999999998,0.59532500000000999]
[null,null,null,null,null,null,null,null,null,null,null,197.50000000000699,0.49154999999999999,0.59519500000001002,0.45119999999999993,0.42129000000002004,0.53190000000000004,0.76910000000000001,0.49154999999999999,0.59519500000001002]
[null,null,null,null,null,null,null,null,null,null,null,197.60000000000699,0.49149999999999999,0.59506500000001006,0.45109999999999995,0.42103000000002011,0.53190000000000004,0.76910000000000001,0.49149999999999999,0.59506500000001006]
[null,null,null,null,null,null,null,null,null,null,null,197.70000000000701,0.49145,0.59493500000001009,0.45099999999999996,0.42077000000002018,0.53190000000000004,0.76910000000000001,0.49145,0.59493500000001009]
[null,null,null,null,null,null,null,null,null,null,null,197.800000000007,0.4914,0.59480500000001013,0.45089999999999997,0.42051000000002026,0.53190000000000004,0.76910000000000001,0.4914,0.59480500000001013]
[null,null,null,null,null,null,null,null,null,null,null,197.900000000007,0.49135000000000001,0.59467500000001017,0.45089999999999997,0.42025000000002033,0.53180000000000005,0.76910000000000001,0.49135000000000001,0.59467500000001017]
[null,null,null,null,null,null,null,null,null,null,null,198.00000000000699,0.49130000000000001,0.5945450000000102,0.45079999999999998,0.4199900000000204,0.53180000000000005,0.76910000000000001,0.49130000000000001,0.5945450000000102]
[null,null,null,null,null,null,null,null,null,null,null,198.10000000000699,0.49125000000000002,0.59441500000001024,0.45069999999999999,0.41973000000002048,0.53180000000000005,0.76910000000000001,0.49125000000000002,0.59441500000001024]
[null,null,null,null,null,null,null,null,null,null,null,198.20000000000701,0.49120000000000003,0.59428500000001028,0.4506,0.41947000000002055,0.53180000000000005,0.76910000000000001,0.49120000000000003,0.59428500000001028]
[null,null,null,null,null,null,null,null,null,null,null,198.300000000007,0.49114999999999998,0.59415500000001031,0.4504999999999999,0.41921000000002062,0.53180000000000005,0.76910000000000001,0.49114999999999998,0.59415500000001031]
[null,null,null,null,null,null,null,null,null,null,null,198.400000000007,0.49109999999999998,0.59402500000001035,0.45039999999999991,0.41895000000002069,0.53180000000000005,0.76910000000000001,0.49109999999999998,0.59402500000001035]
[null,null,null,null,null,null,null,null,null,null,null,198.50000000000799,0.49104999999999999,0.59389500000001039,0.45040000000000002,0.41869000000002077,0.53169999999999995,0.76910000000000001,0.49104999999999999,0.59389500000001039]
[null,null,null,null,null,null,null,null,null,null,null,198.60000000000699,0.49099999999999999,0.59376500000001042,0.45030000000000003,0.41843000000002084,0.53169999999999995,0.76910000000000001,0.49099999999999999,0.59376500000001042]
[null,null,null,null,null,null,null,null,null,null,null,198.70000000000701,0.49095,0.59363500000001046,0.45020000000000004,0.41817000000002091,0.53169999999999995,0.76910000000000001,0.49095,0.59363500000001046]
[null,null,null,null,null,null,null,null,null,null,null,198.800000000007,0.4909,0.5935050000000105,0.45010000000000006,0.41791000000002099,0.53169999999999995,0.76910000000000001,0.4909,0.5935050000000105]
[null,null,null,null,null,null,null,null,null,null,null,198.900000000007,0.49085000000000001,0.59337500000001053,0.45,0.41765000000002106,0.53169999999999995,0.76910000000000001,0.49085000000000001,0.59337500000001053]
[null,null,null,null,null,null,null,null,null,null,null,199.00000000000799,0.49080000000000001,0.59324500000001057,0.44990000000000008,0.41739000000002113,0.53169999999999995,0.76910000000000001,0.49080000000000001,0.59324500000001057]
[null,null,null,null,null,null,null,null,null,null,null,199.10000000000801,0.49075000000000002,0.59311500000001061,0.44980000000000009,0.41713000000002121,0.53169999999999995,0.76910000000000001,0.49075000000000002,0.59311500000001061]
[null,null,null,null,null,null,null,null,null,null,null,199.200000000008,0.49070000000000003,0.59298500000001064,0.4497000000000001,0.41687000000002128,0.53169999999999995,0.76910000000000001,0.49070000000000003,0.59298500000001064]
[null,null,null,null,null,null,null,null,null,null,null,199.300000000008,0.49064999999999998,0.59285500000001068,0.4496,0.41661000000002135,0.53169999999999995,0.76910000000000001,0.49064999999999998,0.59285500000001068]
[null,null,null,null,null,null,null,null,null,null,null,199.40000000000799,0.49059999999999998,0.59272500000001072,0.4496,0.41635000000002143,0.53159999999999996,0.76910000000000001,0.49059999999999998,0.59272500000001072]
[null,null,null,null,null,null,null,null,null,null,null,199.50000000000799,0.49054999999999999,0.59259500000001075,0.44950000000000001,0.4160900000000215,0.53159999999999996,0.76910000000000001,0.49054999999999999,0.59259500000001075]
[null,null,null,null,null,null,null,null,null,null,null,199.60000000000801,0.49049999999999999,0.59246500000001079,0.44940000000000002,0.41583000000002157,0.53159999999999996,0.76910000000000001,0.49049999999999999,0.59246500000001079]
[null,null,null,null,null,null,null,null,null,null,null,199.700000000008,0.49045,0.59233500000001083,0.44930000000000003,0.41557000000002164,0.53159999999999996,0.76910000000000001,0.49045,0.59233500000001083]
[null,null,null,null,null,null,null,null,null,null,null,199.800000000008,0.4904,0.59220500000001086,0.44920000000000004,0.41531000000002172,0.53159999999999996,0.76910000000000001,0.4904,0.59220500000001086]
[null,null,null,null,null,null,null,null,null,null,null,199.90000000000799,0.49035000000000001,0.5920750000000109,0.44910000000000005,0.41505000000002179,0.53159999999999996,0.76910000000000001,0.49035000000000001,0.5920750000000109]
[null,null,null,null,null,null,null,null,null,null,null,200.00000000000799,0.49030000000000001,0.59194500000001093,0.44900000000000007,0.41479000000002186,0.53159999999999996,0.76910000000000001,0.49030000000000001,0.59194500000001093]
[null,null,null,null,null,null,null,null,null,null,null,200.10000000000801,0.49025000000000002,0.59181500000001097,0.44890000000000008,0.41453000000002194,0.53159999999999996,0.76910000000000001,0.49025000000000002,0.59181500000001097]
[null,null,null,null,null,null,null,null,null,null,null,200.200000000008,0.49020000000000002,0.59168500000001101,0.44880000000000009,0.41427000000002201,0.53159999999999996,0.76910000000000001,0.49020000000000002,0.59168500000001101]
[null,null,null,null,null,null,null,null,null,null,null,200.300000000008,0.49014999999999997,0.59155500000001104,0.44869999999999999,0.41401000000002208,0.53159999999999996,0.76910000000000001,0.49014999999999997,0.59155500000001104]
[null,null,null,null,null,null,null,null,null,null,null,200.40000000000799,0.49009999999999998,0.59142500000001108,0.4486,0.41375000000002216,0.53159999999999996,0.76910000000000001,0.49009999999999998,0.59142500000001108]
[null,null,null,null,null,null,null,null,null,null,null,200.50000000000799,0.49004999999999999,0.59129500000001112,0.44850000000000001,0.41349000000002223,0.53159999999999996,0.76910000000000001,0.49004999999999999,0.59129500000001112]
[null,null,null,null,null,null,null,null,null,null,null,200.60000000000801,0.49,0.59116500000001115,0.44850000000000001,0.4132300000000223,0.53149999999999997,0.76910000000000001,0.49,0.59116500000001115]
[null,null,null,null,null,null,null,null,null,null,null,200.700000000008,0.48995,0.59103500000001119,0.44840000000000002,0.41297000000002237,0.53149999999999997,0.76910000000000001,0.48995,0.59103500000001119]
[null,null,null,null,null,null,null,null,null,null,null,200.800000000008,0.4899,0.59090500000001123,0.44830000000000003,0.41271000000002245,0.53149999999999997,0.76910000000000001,0.4899,0.59090500000001123]
[null,null,null,null,null,null,null,null,null,null,null,200.90000000000799,0.48985000000000001,0.59077500000001126,0.44820000000000004,0.41245000000002252,0.53149999999999997,0.76910000000000001,0.48985000000000001,0.59077500000001126]
[null,null,null,null,null,null,null,null,null,null,null,201.00000000000799,0.48980000000000001,0.5906450000000113,0.44810000000000005,0.41219000000002259,0.53149999999999997,0.76910000000000001,0.48980000000000001,0.5906450000000113]
[null,null,null,null,null,null,null,null,null,null,null,201.10000000000801,0.48975000000000002,0.59051500000001134,0.44800000000000006,0.41193000000002267,0.53149999999999997,0.76910000000000001,0.48975000000000002,0.59051500000001134]
[null,null,null,null,null,null,null,null,null,null,null,201.200000000008,0.48970000000000002,0.59038500000001137,0.44790000000000008,0.41167000000002274,0.53149999999999997,0.76910000000000001,0.48970000000000002,0.59038500000001137]
[null,null,null,null,null,null,null,null,null,null,null,201.300000000008,0.48964999999999997,0.59025500000001141,0.44779999999999998,0.41141000000002281,0.53149999999999997,0.76910000000000001,0.48964999999999997,0.59025500000001141]
[null,null,null,null,null,null,null,null,null,null,null,201.40000000000799,0.48959999999999998,0.59012500000001145,0.44769999999999999,0.41115000000002289,0.53149999999999997,0.76910000000000001,0.48959999999999998,0.59012500000001145]
[null,null,null,null,null,null,null,null,null,null,null,201.50000000000799,0.48954999999999999,0.58999500000001148,0.4476,0.41089000000002296,0.53149999999999997,0.76910000000000001,0.48954999999999999,0.58999500000001148]
[null,null,null,null,null,null,null,null,null,null,null,201.60000000000801,0.48949999999999999,0.58986500000001152,0.44750000000000001,0.41063000000002303,0.53149999999999997,0.76910000000000001,0.48949999999999999,0.58986500000001152]
[null,null,null,null,null,null,null,null,null,null,null,201.700000000008,0.48945,0.58973500000001156,0.44740000000000002,0.41037000000002311,0.53149999999999997,0.76910000000000001,0.48945,0.58973500000001156]
[null,null,null,null,null,null,null,null,null,null,null,201.800000000008,0.4894,0.58960500000001159,0.44730000000000003,0.41011000000002318,0.53149999999999997,0.76910000000000001,0.4894,0.58960500000001159]
[null,null,null,null,null,null,null,null,null,null,null,201.90000000000799,0.48935000000000001,0.58947500000001163,0.44720000000000004,0.40985000000002325,0.53149999999999997,0.76910000000000001,0.48935000000000001,0.58947500000001163]
[null,null,null,null,null,null,null,null,null,null,null,202.00000000000799,0.48930000000000001,0.58934500000001167,0.44710000000000005,0.40959000000002332,0.53149999999999997,0.76910000000000001,0.48930000000000001,0.58934500000001167]
[null,null,null,null,null,null,null,null,null,null,null,202.10000000000801,0.48925000000000002,0.5892150000000117,0.44700000000000006,0.4093300000000234,0.53149999999999997,0.76910000000000001,0.48925000000000002,0.5892150000000117]
[null,null,null,null,null,null,null,null,null,null,null,202.200000000008,0.48920000000000002,0.58908500000001174,0.44690000000000007,0.40907000000002347,0.53149999999999997,0.76910000000000001,0.48920000000000002,0.58908500000001174]
[null,null,null,null,null,null,null,null,null,null,null,202.300000000008,0.48914999999999997,0.58895500000001177,0.44679999999999997,0.40881000000002354,0.53149999999999997,0.76910000000000001,0.48914999999999997,0.58895500000001177]
[null,null,null,null,null,null,null,null,null,null,null,202.40000000000799,0.48909999999999998,0.58882500000001181,0.44669999999999999,0.40855000000002362,0.53149999999999997,0.76910000000000001,0.48909999999999998,0.58882500000001181]
[null,null,null,null,null,null,null,null,null,null,null,202.50000000000799,0.48904999999999998,0.58869500000001185,0.4466,0.40829000000002369,0.53149999999999997,0.76910000000000001,0.48904999999999998,0.58869500000001185]
[null,null,null,null,null,null,null,null,null,null,null,202.60000000000801,0.48899999999999999,0.58856500000001188,0.44650000000000001,0.40803000000002376,0.53149999999999997,0.76910000000000001,0.48899999999999999,0.58856500000001188]
[null,null,null,null,null,null,null,null,null,null,null,202.700000000008,0.48895,0.58843500000001192,0.44640000000000002,0.40777000000002384,0.53149999999999997,0.76910000000000001,0.48895,0.58843500000001192]
[null,null,null,null,null,null,null,null,null,null,null,202.800000000008,0.4889,0.58830500000001196,0.44630000000000003,0.40751000000002391,0.53149999999999997,0.76910000000000001,0.4889,0.58830500000001196]
[null,null,null,null,null,null,null,null,null,null,null,202.90000000000899,0.48885000000000001,0.58817500000001199,0.44620000000000004,0.40725000000002398,0.53149999999999997,0.76910000000000001,0.48885000000000001,0.58817500000001199]
[null,null,null,null,null,null,null,null,null,null,null,203.00000000000799,0.48880000000000001,0.58804500000001203,0.44610000000000005,0.40699000000002405,0.53149999999999997,0.76910000000000001,0.48880000000000001,0.58804500000001203]
[null,null,null,null,null,null,null,null,null,null,null,203.10000000000801,0.48875000000000002,0.58791500000001207,0.44600000000000006,0.40673000000002413,0.53149999999999997,0.76910000000000001,0.48875000000000002,0.58791500000001207]
[null,null,null,null,null,null,null,null,null,null,null,203.200000000008,0.48870000000000002,0.5877850000000121,0.44590000000000007,0.4064700000000242,0.53149999999999997,0.76910000000000001,0.48870000000000002,0.5877850000000121]
[null,null,null,null,null,null,null,null,null,null,null,203.300000000008,0.48864999999999997,0.58765500000001214,0.44579999999999997,0.40621000000002427,0.53149999999999997,0.76910000000000001,0.48864999999999997,0.58765500000001214]
[null,null,null,null,null,null,null,null,null,null,null,203.40000000000899,0.48859999999999998,0.58752500000001218,0.44569999999999999,0.40595000000002435,0.53149999999999997,0.76910000000000001,0.48859999999999998,0.58752500000001218]
[null,null,null,null,null,null,null,null,null,null,null,203.50000000000901,0.48854999999999998,0.58739500000001221,0.4456,0.40569000000002442,0.53149999999999997,0.76910000000000001,0.48854999999999998,0.58739500000001221]
[null,null,null,null,null,null,null,null,null,null,null,203.600000000009,0.48849999999999999,0.58726500000001225,0.44540000000000002,0.40543000000002449,0.53159999999999996,0.76910000000000001,0.48849999999999999,0.58726500000001225]
[null,null,null,null,null,null,null,null,null,null,null,203.700000000009,0.48845,0.58713500000001229,0.44530000000000003,0.40517000000002457,0.53159999999999996,0.76910000000000001,0.48845,0.58713500000001229]
[null,null,null,null,null,null,null,null,null,null,null,203.80000000000899,0.4884,0.58700500000001232,0.44520000000000004,0.40491000000002464,0.53159999999999996,0.76910000000000001,0.4884,0.58700500000001232]
[null,null,null,null,null,null,null,null,null,null,null,203.90000000000899,0.48835000000000001,0.58687500000001236,0.44510000000000005,0.40465000000002471,0.53159999999999996,0.76910000000000001,0.48835000000000001,0.58687500000001236]
[null,null,null,null,null,null,null,null,null,null,null,204.00000000000901,0.48830000000000001,0.5867450000000124,0.44500000000000001,0.40439000000002479,0.53159999999999996,0.76910000000000001,0.48830000000000001,0.5867450000000124]
[null,null,null,null,null,null,null,null,null,null,null,204.100000000009,0.48825000000000002,0.58661500000001243,0.44490000000000007,0.40413000000002486,0.53159999999999996,0.76910000000000001,0.48825000000000002,0.58661500000001243]
[null,null,null,null,null,null,null,null,null,null,null,204.200000000009,0.48820000000000002,0.58648500000001247,0.44480000000000008,0.40387000000002493,0.53159999999999996,0.76910000000000001,0.48820000000000002,0.58648500000001247]
[null,null,null,null,null,null,null,null,null,null,null,204.30000000000899,0.48814999999999997,0.58635500000001251,0.44469999999999998,0.403610000000025,0.53159999999999996,0.76910000000000001,0.48814999999999997,0.58635500000001251]
[null,null,null,null,null,null,null,null,null,null,null,204.40000000000899,0.48809999999999998,0.58622500000001254,0.4446,0.40335000000002508,0.53159999999999996,0.76910000000000001,0.48809999999999998,0.58622500000001254]
[null,null,null,null,null,null,null,null,null,null,null,204.50000000000901,0.48804999999999998,0.58609500000001258,0.44450000000000001,0.40309000000002515,0.53159999999999996,0.76910000000000001,0.48804999999999998,0.58609500000001258]
[null,null,null,null,null,null,null,null,null,null,null,204.600000000009,0.48799999999999999,0.58596500000001261,0.44440000000000002,0.40283000000002522,0.53159999999999996,0.76910000000000001,0.48799999999999999,0.58596500000001261]
[null,null,null,null,null,null,null,null,null,null,null,204.700000000009,0.48794999999999999,0.58583500000001265,0.44420000000000004,0.4025700000000253,0.53169999999999995,0.76910000000000001,0.48794999999999999,0.58583500000001265]
[null,null,null,null,null,null,null,null,null,null,null,204.80000000000899,0.4879,0.58570500000001269,0.44410000000000005,0.40231000000002537,0.53169999999999995,0.76910000000000001,0.4879,0.58570500000001269]
[null,null,null,null,null,null,null,null,null,null,null,204.90000000000899,0.48785000000000001,0.58557500000001272,0.44400000000000006,0.40205000000002544,0.53169999999999995,0.76910000000000001,0.48785000000000001,0.58557500000001272]
[null,null,null,null,null,null,null,null,null,null,null,205.00000000000901,0.48780499999999999,0.58544500000001276,0.44391000000000003,0.40179000000002552,0.53169999999999995,0.76910000000000001,0.48780499999999999,0.58544500000001276]
[null,null,null,null,null,null,null,null,null,null,null,205.100000000009,0.487765,0.5853150000000128,0.44383000000000006,0.40153000000002559,0.53169999999999995,0.76910000000000001,0.487765,0.5853150000000128]
[null,null,null,null,null,null,null,null,null,null,null,205.200000000009,0.48772500000000002,0.58518500000001283,0.44374999999999998,0.40127000000002566,0.53169999999999995,0.76910000000000001,0.48772500000000002,0.58518500000001283]
[null,null,null,null,null,null,null,null,null,null,null,205.30000000000899,0.48768499999999998,0.58505500000001287,0.44367000000000001,0.40101000000002573,0.53169999999999995,0.76910000000000001,0.48768499999999998,0.58505500000001287]
[null,null,null,null,null,null,null,null,null,null,null,205.40000000000899,0.487645,0.58492500000001291,0.44348999999999994,0.40075000000002581,0.53180000000000005,0.76910000000000001,0.487645,0.58492500000001291]
[null,null,null,null,null,null,null,null,null,null,null,205.50000000000901,0.48760500000000001,0.58479500000001294,0.44340999999999997,0.40049000000002588,0.53180000000000005,0.76910000000000001,0.48760500000000001,0.58479500000001294]
[null,null,null,null,null,null,null,null,null,null,null,205.600000000009,0.48756500000000003,0.58466500000001298,0.44333,0.40023000000002595,0.53180000000000005,0.76910000000000001,0.48756500000000003,0.58466500000001298]
[null,null,null,null,null,null,null,null,null,null,null,205.700000000009,0.48752499999999999,0.58453500000001302,0.44324999999999992,0.39997000000002603,0.53180000000000005,0.76910000000000001,0.48752499999999999,0.58453500000001302]
[null,null,null,null,null,null,null,null,null,null,null,205.80000000000899,0.487485,0.58440500000001305,0.44316999999999995,0.3997100000000261,0.53180000000000005,0.76910000000000001,0.487485,0.58440500000001305]
[null,null,null,null,null,null,null,null,null,null,null,205.90000000000899,0.48744500000000002,0.58427500000001309,0.44308999999999998,0.39945000000002617,0.53180000000000005,0.76910000000000001,0.48744500000000002,0.58427500000001309]
[null,null,null,null,null,null,null,null,null,null,null,206.00000000000901,0.48740499999999998,0.58414500000001313,0.4430099999999999,0.39919000000002625,0.53180000000000005,0.76910000000000001,0.48740499999999998,0.58414500000001313]
[null,null,null,null,null,null,null,null,null,null,null,206.100000000009,0.48736499999999999,0.58401500000001316,0.44292999999999993,0.39893000000002632,0.53180000000000005,0.76910000000000001,0.48736499999999999,0.58401500000001316]
[null,null,null,null,null,null,null,null,null,null,null,206.200000000009,0.48732500000000001,0.5838850000000132,0.44284999999999997,0.39867000000002639,0.53180000000000005,0.76910000000000001,0.48732500000000001,0.5838850000000132]
[null,null,null,null,null,null,null,null,null,null,null,206.30000000000899,0.48728500000000002,0.58375500000001324,0.44277,0.39841000000002647,0.53180000000000005,0.76910000000000001,0.48728500000000002,0.58375500000001324]
[null,null,null,null,null,null,null,null,null,null,null,206.40000000000899,0.48724499999999998,0.58362500000001327,0.44268999999999992,0.39815000000002654,0.53180000000000005,0.76910000000000001,0.48724499999999998,0.58362500000001327]
[null,null,null,null,null,null,null,null,null,null,null,206.50000000000901,0.487205,0.58349500000001331,0.44260999999999995,0.39789000000002661,0.53180000000000005,0.76910000000000001,0.487205,0.58349500000001331]
[null,null,null,null,null,null,null,null,null,null,null,206.600000000009,0.48716500000000001,0.58336500000001335,0.44252999999999998,0.39763000000002668,0.53180000000000005,0.76910000000000001,0.48716500000000001,0.58336500000001335]
[null,null,null,null,null,null,null,null,null,null,null,206.700000000009,0.48712499999999997,0.58323500000001338,0.4424499999999999,0.39737000000002676,0.53180000000000005,0.76910000000000001,0.48712499999999997,0.58323500000001338]
[null,null,null,null,null,null,null,null,null,null,null,206.80000000000899,0.48708499999999999,0.58310500000001342,0.44236999999999993,0.39711000000002683,0.53180000000000005,0.76910000000000001,0.48708499999999999,0.58310500000001342]
[null,null,null,null,null,null,null,null,null,null,null,206.90000000000899,0.48704500000000001,0.58297500000001345,0.44228999999999996,0.3968500000000269,0.53180000000000005,0.76910000000000001,0.48704500000000001,0.58297500000001345]
[null,null,null,null,null,null,null,null,null,null,null,207.00000000000901,0.48700500000000002,0.58284500000001349,0.44220999999999999,0.39659000000002698,0.53180000000000005,0.76910000000000001,0.48700500000000002,0.58284500000001349]
[null,null,null,null,null,null,null,null,null,null,null,207.100000000009,0.48696499999999998,0.58271500000001353,0.44212999999999991,0.39633000000002705,0.53180000000000005,0.76910000000000001,0.48696499999999998,0.58271500000001353]
[null,null,null,null,null,null,null,null,null,null,null,207.200000000009,0.486925,0.58258500000001356,0.44204999999999994,0.39607000000002712,0.53180000000000005,0.76910000000000001,0.486925,0.58258500000001356]
[null,null,null,null,null,null,null,null,null,null,null,207.30000000000999,0.48688500000000001,0.5824550000000136,0.44196999999999997,0.3958100000000272,0.53180000000000005,0.76910000000000001,0.48688500000000001,0.5824550000000136]
[null,null,null,null,null,null,null,null,null,null,null,207.40000000000899,0.48684500000000003,0.58232500000001364,0.44189000000000001,0.39555000000002727,0.53180000000000005,0.76910000000000001,0.48684500000000003,0.58232500000001364]
[null,null,null,null,null,null,null,null,null,null,null,207.50000000000901,0.48680499999999999,0.58219500000001367,0.44180999999999993,0.39529000000002734,0.53180000000000005,0.76910000000000001,0.48680499999999999,0.58219500000001367]
[null,null,null,null,null,null,null,null,null,null,null,207.600000000009,0.486765,0.58206500000001371,0.44172999999999996,0.39503000000002741,0.53180000000000005,0.76910000000000001,0.486765,0.58206500000001371]
[null,null,null,null,null,null,null,null,null,null,null,207.700000000009,0.48672500000000002,0.58193500000001375,0.44164999999999999,0.39477000000002749,0.53180000000000005,0.76910000000000001,0.48672500000000002,0.58193500000001375]
[null,null,null,null,null,null,null,null,null,null,null,207.80000000000999,0.48668499999999998,0.58180500000001378,0.44156999999999991,0.39451000000002756,0.53180000000000005,0.76910000000000001,0.48668499999999998,0.58180500000001378]
[null,null,null,null,null,null,null,null,null,null,null,207.90000000001001,0.48664499999999999,0.58167500000001382,0.44148999999999994,0.39425000000002763,0.53180000000000005,0.76910000000000001,0.48664499999999999,0.58167500000001382]
[null,null,null,null,null,null,null,null,null,null,null,208.00000000001,0.48660500000000001,0.58154500000001386,0.44140999999999997,0.39399000000002771,0.53180000000000005,0.76910000000000001,0.48660500000000001,0.58154500000001386]
[null,null,null,null,null,null,null,null,null,null,null,208.10000000001,0.48656500000000003,0.58141500000001389,0.44133,0.39373000000002778,0.53180000000000005,0.76910000000000001,0.48656500000000003,0.58141500000001389]
[null,null,null,null,null,null,null,null,null,null,null,208.20000000000999,0.48652499999999999,0.58128500000001393,0.44124999999999998,0.39347000000002785,0.53180000000000005,0.76910000000000001,0.48652499999999999,0.58128500000001393]
[null,null,null,null,null,null,null,null,null,null,null,208.30000000000999,0.486485,0.58115500000001397,0.44116999999999995,0.39321000000002793,0.53180000000000005,0.76910000000000001,0.486485,0.58115500000001397]
[null,null,null,null,null,null,null,null,null,null,null,208.40000000001001,0.48644500000000002,0.581025000000014,0.44108999999999998,0.392950000000028,0.53180000000000005,0.76910000000000001,0.48644500000000002,0.581025000000014]
[null,null,null,null,null,null,null,null,null,null,null,208.50000000001,0.48640499999999998,0.58089500000001404,0.4410099999999999,0.39269000000002807,0.53180000000000005,0.76910000000000001,0.48640499999999998,0.58089500000001404]
[null,null,null,null,null,null,null,null,null,null,null,208.60000000001,0.48636499999999999,0.58076500000001408,0.44092999999999993,0.39243000000002815,0.53180000000000005,0.76910000000000001,0.48636499999999999,0.58076500000001408]
[null,null,null,null,null,null,null,null,null,null,null,208.70000000000999,0.48632500000000001,0.58063500000001411,0.44084999999999996,0.39217000000002822,0.53180000000000005,0.76910000000000001,0.48632500000000001,0.58063500000001411]
[null,null,null,null,null,null,null,null,null,null,null,208.80000000000999,0.48628500000000002,0.58050500000001415,0.44077,0.39191000000002829,0.53180000000000005,0.76910000000000001,0.48628500000000002,0.58050500000001415]
[null,null,null,null,null,null,null,null,null,null,null,208.90000000001001,0.48624499999999998,0.58037500000001419,0.44068999999999992,0.39165000000002836,0.53180000000000005,0.76910000000000001,0.48624499999999998,0.58037500000001419]
[null,null,null,null,null,null,null,null,null,null,null,209.00000000001,0.486205,0.58024500000001422,0.44060999999999995,0.39139000000002844,0.53180000000000005,0.76910000000000001,0.486205,0.58024500000001422]
[null,null,null,null,null,null,null,null,null,null,null,209.10000000001,0.48616500000000001,0.58011500000001426,0.44052999999999998,0.39113000000002851,0.53180000000000005,0.76910000000000001,0.48616500000000001,0.58011500000001426]
[null,null,null,null,null,null,null,null,null,null,null,209.20000000000999,0.48612499999999997,0.57998500000001429,0.4404499999999999,0.39087000000002858,0.53180000000000005,0.76910000000000001,0.48612499999999997,0.57998500000001429]
[null,null,null,null,null,null,null,null,null,null,null,209.30000000000999,0.48608499999999999,0.57985500000001433,0.44036999999999993,0.39061000000002866,0.53180000000000005,0.76910000000000001,0.48608499999999999,0.57985500000001433]
[null,null,null,null,null,null,null,null,null,null,null,209.40000000001001,0.486045,0.57972500000001437,0.44028999999999996,0.39035000000002873,0.53180000000000005,0.76910000000000001,0.486045,0.57972500000001437]
[null,null,null,null,null,null,null,null,null,null,null,209.50000000001,0.48600500000000002,0.5795950000000144,0.44020999999999999,0.3900900000000288,0.53180000000000005,0.76910000000000001,0.48600500000000002,0.5795950000000144]
[null,null,null,null,null,null,null,null,null,null,null,209.60000000001,0.48596499999999998,0.57946500000001444,0.44012999999999991,0.38983000000002888,0.53180000000000005,0.76910000000000001,0.48596499999999998,0.57946500000001444]
[null,null,null,null,null,null,null,null,null,null,null,209.70000000000999,0.485925,0.57933500000001448,0.44004999999999994,0.38957000000002895,0.53180000000000005,0.76910000000000001,0.485925,0.57933500000001448]
[null,null,null,null,null,null,null,null,null,null,null,209.80000000000999,0.48588500000000001,0.57920500000001451,0.43996999999999997,0.38931000000002902,0.53180000000000005,0.76910000000000001,0.48588500000000001,0.57920500000001451]
[null,null,null,null,null,null,null,null,null,null,null,209.90000000001001,0.48584500000000003,0.57907500000001455,0.43989,0.38905000000002909,0.53180000000000005,0.76910000000000001,0.48584500000000003,0.57907500000001455]
[null,null,null,null,null,null,null,null,null,null,null,210.00000000001,0.48580499999999999,0.57894500000001459,0.43980999999999992,0.38879000000002917,0.53180000000000005,0.76910000000000001,0.48580499999999999,0.57894500000001459]
[null,null,null,null,null,null,null,null,null,null,null,210.10000000001,0.485765,0.57881500000001462,0.43972999999999995,0.38853000000002924,0.53180000000000005,0.76910000000000001,0.485765,0.57881500000001462]
[null,null,null,null,null,null,null,null,null,null,null,210.20000000000999,0.48572500000000002,0.57868500000001466,0.43964999999999999,0.38827000000002931,0.53180000000000005,0.76910000000000001,0.48572500000000002,0.57868500000001466]
[null,null,null,null,null,null,null,null,null,null,null,210.30000000000999,0.48568499999999998,0.5785550000000147,0.43956999999999991,0.38801000000002939,0.53180000000000005,0.76910000000000001,0.48568499999999998,0.5785550000000147]
[null,null,null,null,null,null,null,null,null,null,null,210.40000000001001,0.48564499999999999,0.57842500000001473,0.43948999999999994,0.38775000000002946,0.53180000000000005,0.76910000000000001,0.48564499999999999,0.57842500000001473]
[null,null,null,null,null,null,null,null,null,null,null,210.50000000001,0.48560500000000001,0.57829500000001477,0.43940999999999997,0.38749000000002953,0.53180000000000005,0.76910000000000001,0.48560500000000001,0.57829500000001477]
[null,null,null,null,null,null,null,null,null,null,null,210.60000000001,0.48556500000000002,0.57816500000001481,0.43933,0.38723000000002961,0.53180000000000005,0.76910000000000001,0.48556500000000002,0.57816500000001481]
[null,null,null,null,null,null,null,null,null,null,null,210.70000000000999,0.48552499999999998,0.57803500000001484,0.43924999999999992,0.38697000000002968,0.53180000000000005,0.76910000000000001,0.48552499999999998,0.57803500000001484]
[null,null,null,null,null,null,null,null,null,null,null,210.80000000000999,0.485485,0.57790500000001488,0.43916999999999995,0.38671000000002975,0.53180000000000005,0.76910000000000001,0.485485,0.57790500000001488]
[null,null,null,null,null,null,null,null,null,null,null,210.90000000001001,0.48544500000000002,0.57777500000001492,0.43908999999999998,0.38645000000002983,0.53180000000000005,0.76910000000000001,0.48544500000000002,0.57777500000001492]
[null,null,null,null,null,null,null,null,null,null,null,211.00000000001,0.48540499999999998,0.57764500000001495,0.4390099999999999,0.3861900000000299,0.53180000000000005,0.76910000000000001,0.48540499999999998,0.57764500000001495]
[null,null,null,null,null,null,null,null,null,null,null,211.10000000001,0.48536499999999999,0.57751500000001499,0.43892999999999993,0.38593000000002997,0.53180000000000005,0.76910000000000001,0.48536499999999999,0.57751500000001499]
[null,null,null,null,null,null,null,null,null,null,null,211.20000000000999,0.48532500000000001,0.57738500000001503,0.43884999999999996,0.38567000000003004,0.53180000000000005,0.76910000000000001,0.48532500000000001,0.57738500000001503]
[null,null,null,null,null,null,null,null,null,null,null,211.30000000000999,0.48528500000000002,0.57725500000001506,0.43876999999999999,0.38541000000003012,0.53180000000000005,0.76910000000000001,0.48528500000000002,0.57725500000001506]
[null,null,null,null,null,null,null,null,null,null,null,211.40000000001001,0.48524499999999998,0.5771250000000151,0.43868999999999991,0.38515000000003019,0.53180000000000005,0.76910000000000001,0.48524499999999998,0.5771250000000151]
[null,null,null,null,null,null,null,null,null,null,null,211.50000000001,0.485205,0.57699500000001513,0.43860999999999994,0.38489000000003026,0.53180000000000005,0.76910000000000001,0.485205,0.57699500000001513]
[null,null,null,null,null,null,null,null,null,null,null,211.60000000001,0.48516500000000001,0.57686500000001517,0.43852999999999998,0.38463000000003034,0.53180000000000005,0.76910000000000001,0.48516500000000001,0.57686500000001517]
[null,null,null,null,null,null,null,null,null,null,null,211.70000000001099,0.48512499999999997,0.57673500000001521,0.4384499999999999,0.38437000000003041,0.53180000000000005,0.76910000000000001,0.48512499999999997,0.57673500000001521]
[null,null,null,null,null,null,null,null,null,null,null,211.80000000000999,0.48508499999999999,0.57660500000001524,0.43836999999999993,0.38411000000003048,0.53180000000000005,0.76910000000000001,0.48508499999999999,0.57660500000001524]
[null,null,null,null,null,null,null,null,null,null,null,211.90000000001001,0.485045,0.57647500000001528,0.43828999999999996,0.38385000000003056,0.53180000000000005,0.76910000000000001,0.485045,0.57647500000001528]
[null,null,null,null,null,null,null,null,null,null,null,212.00000000001,0.48500500000000002,0.57634500000001532,0.43820999999999999,0.38359000000003063,0.53180000000000005,0.76910000000000001,0.48500500000000002,0.57634500000001532]
[null,null,null,null,null,null,null,null,null,null,null,212.10000000001099,0.48496499999999998,0.57621500000001535,0.43812999999999991,0.3833300000000307,0.53180000000000005,0.76910000000000001,0.48496499999999998,0.57621500000001535]
[null,null,null,null,null,null,null,null,null,null,null,212.20000000001099,0.48492499999999999,0.57608500000001539,0.43804999999999994,0.38307000000003077,0.53180000000000005,0.76910000000000001,0.48492499999999999,0.57608500000001539]
[null,null,null,null,null,null,null,null,null,null,null,212.30000000001101,0.48488500000000001,0.57595500000001543,0.43796999999999997,0.38281000000003085,0.53180000000000005,0.76910000000000001,0.48488500000000001,0.57595500000001543]
[null,null,null,null,null,null,null,null,null,null,null,212.400000000011,0.48484500000000003,0.57582500000001546,0.43789,0.38255000000003092,0.53180000000000005,0.76910000000000001,0.48484500000000003,0.57582500000001546]
[null,null,null,null,null,null,null,null,null,null,null,212.500000000011,0.48480499999999999,0.5756950000000155,0.43780999999999992,0.38229000000003099,0.53180000000000005,0.76910000000000001,0.48480499999999999,0.5756950000000155]
[null,null,null,null,null,null,null,null,null,null,null,212.60000000001099,0.484765,0.57556500000001554,0.43772999999999995,0.38203000000003107,0.53180000000000005,0.76910000000000001,0.484765,0.57556500000001554]
[null,null,null,null,null,null,null,null,null,null,null,212.70000000001099,0.48472500000000002,0.57543500000001557,0.43764999999999998,0.38177000000003114,0.53180000000000005,0.76910000000000001,0.48472500000000002,0.57543500000001557]
[null,null,null,null,null,null,null,null,null,null,null,212.80000000001101,0.48468499999999998,0.57530500000001561,0.4375699999999999,0.38151000000003121,0.53180000000000005,0.76910000000000001,0.48468499999999998,0.57530500000001561]
[null,null,null,null,null,null,null,null,null,null,null,212.900000000011,0.48464499999999999,0.57517500000001565,0.43748999999999993,0.38125000000003129,0.53180000000000005,0.76910000000000001,0.48464499999999999,0.57517500000001565]
[null,null,null,null,null,null,null,null,null,null,null,213.000000000011,0.48460500000000001,0.57504500000001568,0.43740999999999997,0.38099000000003136,0.53180000000000005,0.76910000000000001,0.48460500000000001,0.57504500000001568]
[null,null,null,null,null,null,null,null,null,null,null,213.10000000001099,0.48456500000000002,0.57491500000001572,0.43733,0.38073000000003143,0.53180000000000005,0.76910000000000001,0.48456500000000002,0.57491500000001572]
[null,null,null,null,null,null,null,null,null,null,null,213.20000000001099,0.48452499999999998,0.57478500000001576,0.43724999999999992,0.38047000000003151,0.53180000000000005,0.76910000000000001,0.48452499999999998,0.57478500000001576]
[null,null,null,null,null,null,null,null,null,null,null,213.30000000001101,0.484485,0.57465500000001579,0.43716999999999995,0.38021000000003158,0.53180000000000005,0.76910000000000001,0.484485,0.57465500000001579]
[null,null,null,null,null,null,null,null,null,null,null,213.400000000011,0.48444500000000001,0.57452500000001583,0.43708999999999998,0.37995000000003165,0.53180000000000005,0.76910000000000001,0.48444500000000001,0.57452500000001583]
[null,null,null,null,null,null,null,null,null,null,null,213.500000000011,0.48440499999999997,0.57439500000001587,0.4370099999999999,0.37969000000003172,0.53180000000000005,0.76910000000000001,0.48440499999999997,0.57439500000001587]
[null,null,null,null,null,null,null,null,null,null,null,213.60000000001099,0.48436499999999999,0.5742650000000159,0.43692999999999993,0.3794300000000318,0.53180000000000005,0.76910000000000001,0.48436499999999999,0.5742650000000159]
[null,null,null,null,null,null,null,null,null,null,null,213.70000000001099,0.48432500000000001,0.57413500000001594,0.43684999999999996,0.37917000000003187,0.53180000000000005,0.76910000000000001,0.48432500000000001,0.57413500000001594]
[null,null,null,null,null,null,null,null,null,null,null,213.80000000001101,0.48428500000000002,0.57400500000001597,0.43676999999999999,0.37891000000003194,0.53180000000000005,0.76910000000000001,0.48428500000000002,0.57400500000001597]
[null,null,null,null,null,null,null,null,null,null,null,213.900000000011,0.48424499999999998,0.57387500000001601,0.43668999999999991,0.37865000000003202,0.53180000000000005,0.76910000000000001,0.48424499999999998,0.57387500000001601]
[null,null,null,null,null,null,null,null,null,null,null,214.000000000011,0.484205,0.57374500000001605,0.43660999999999994,0.37839000000003209,0.53180000000000005,0.76910000000000001,0.484205,0.57374500000001605]
[null,null,null,null,null,null,null,null,null,null,null,214.10000000001099,0.48416500000000001,0.57361500000001608,0.43652999999999997,0.37813000000003216,0.53180000000000005,0.76910000000000001,0.48416500000000001,0.57361500000001608]
[null,null,null,null,null,null,null,null,null,null,null,214.20000000001099,0.48412500000000003,0.57348500000001612,0.43645,0.37787000000003224,0.53180000000000005,0.76910000000000001,0.48412500000000003,0.57348500000001612]
[null,null,null,null,null,null,null,null,null,null,null,214.30000000001101,0.48408499999999999,0.57335500000001616,0.43636999999999992,0.37761000000003231,0.53180000000000005,0.76910000000000001,0.48408499999999999,0.57335500000001616]
[null,null,null,null,null,null,null,null,null,null,null,214.400000000011,0.484045,0.57322500000001619,0.43628999999999996,0.37735000000003238,0.53180000000000005,0.76910000000000001,0.484045,0.57322500000001619]
[null,null,null,null,null,null,null,null,null,null,null,214.500000000011,0.48400500000000002,0.57309500000001623,0.43620999999999999,0.37709000000003245,0.53180000000000005,0.76910000000000001,0.48400500000000002,0.57309500000001623]
[null,null,null,null,null,null,null,null,null,null,null,214.60000000001099,0.48396499999999998,0.57296500000001627,0.43612999999999991,0.37683000000003253,0.53180000000000005,0.76910000000000001,0.48396499999999998,0.57296500000001627]
[null,null,null,null,null,null,null,null,null,null,null,214.70000000001099,0.48392499999999999,0.5728350000000163,0.43604999999999994,0.3765700000000326,0.53180000000000005,0.76910000000000001,0.48392499999999999,0.5728350000000163]
[null,null,null,null,null,null,null,null,null,null,null,214.80000000001101,0.48388500000000001,0.57270500000001634,0.43596999999999997,0.37631000000003267,0.53180000000000005,0.76910000000000001,0.48388500000000001,0.57270500000001634]
[null,null,null,null,null,null,null,null,null,null,null,214.900000000011,0.48384500000000003,0.57257500000001638,0.43589,0.37605000000003275,0.53180000000000005,0.76910000000000001,0.48384500000000003,0.57257500000001638]
[null,null,null,null,null,null,null,null,null,null,null,215.000000000011,0.48381000000000002,0.57244500000001641,0.43581999999999999,0.37579000000003282,0.53180000000000005,0.76910000000000001,0.48381000000000002,0.57244500000001641]
[null,null,null,null,null,null,null,null,null,null,null,215.10000000001099,0.48377999999999999,0.57231500000001645,0.43575999999999993,0.37553000000003289,0.53180000000000005,0.76910000000000001,0.48377999999999999,0.57231500000001645]
[null,null,null,null,null,null,null,null,null,null,null,215.20000000001099,0.48375000000000001,0.57218500000001649,0.43569999999999998,0.37527000000003297,0.53180000000000005,0.76910000000000001,0.48375000000000001,0.57218500000001649]
[null,null,null,null,null,null,null,null,null,null,null,215.30000000001101,0.48371999999999998,0.57205500000001652,0.43563999999999992,0.37501000000003304,0.53180000000000005,0.76910000000000001,0.48371999999999998,0.57205500000001652]
[null,null,null,null,null,null,null,null,null,null,null,215.400000000011,0.48369000000000001,0.57192500000001656,0.43557999999999997,0.37475000000003311,0.53180000000000005,0.76910000000000001,0.48369000000000001,0.57192500000001656]
[null,null,null,null,null,null,null,null,null,null,null,215.500000000011,0.48365999999999998,0.5717950000000166,0.43551999999999991,0.37449000000003319,0.53180000000000005,0.76910000000000001,0.48365999999999998,0.5717950000000166]
[null,null,null,null,null,null,null,null,null,null,null,215.60000000001099,0.48363,0.57166500000001663,0.43545999999999996,0.37423000000003326,0.53180000000000005,0.76910000000000001,0.48363,0.57166500000001663]
[null,null,null,null,null,null,null,null,null,null,null,215.70000000001099,0.48359999999999997,0.57153500000001667,0.4353999999999999,0.37397000000003333,0.53180000000000005,0.76910000000000001,0.48359999999999997,0.57153500000001667]
[null,null,null,null,null,null,null,null,null,null,null,215.80000000001101,0.48357,0.57140500000001671,0.43533999999999995,0.3737100000000334,0.53180000000000005,0.76910000000000001,0.48357,0.57140500000001671]
[null,null,null,null,null,null,null,null,null,null,null,215.900000000011,0.48354000000000003,0.57127500000001674,0.43528,0.37345000000003348,0.53180000000000005,0.76910000000000001,0.48354000000000003,0.57127500000001674]
[null,null,null,null,null,null,null,null,null,null,null,216.000000000011,0.48351,0.57114500000001678,0.43521999999999994,0.37319000000003355,0.53180000000000005,0.76910000000000001,0.48351,0.57114500000001678]
[null,null,null,null,null,null,null,null,null,null,null,216.10000000001199,0.48348000000000002,0.57101500000001681,0.43515999999999999,0.37293000000003362,0.53180000000000005,0.76910000000000001,0.48348000000000002,0.57101500000001681]
[null,null,null,null,null,null,null,null,null,null,null,216.20000000001099,0.48344999999999999,0.57088500000001685,0.43509999999999993,0.3726700000000337,0.53180000000000005,0.76910000000000001,0.48344999999999999,0.57088500000001685]
[null,null,null,null,null,null,null,null,null,null,null,216.30000000001101,0.48342000000000002,0.57075500000001689,0.43503999999999998,0.37241000000003377,0.53180000000000005,0.76910000000000001,0.48342000000000002,0.57075500000001689]
[null,null,null,null,null,null,null,null,null,null,null,216.400000000011,0.48338999999999999,0.57062500000001692,0.43497999999999992,0.37215000000003384,0.53180000000000005,0.76910000000000001,0.48338999999999999,0.57062500000001692]
[null,null,null,null,null,null,null,null,null,null,null,216.50000000001199,0.48336000000000001,0.57049500000001696,0.43491999999999997,0.37189000000003392,0.53180000000000005,0.76910000000000001,0.48336000000000001,0.57049500000001696]
[null,null,null,null,null,null,null,null,null,null,null,216.60000000001199,0.48332999999999998,0.570365000000017,0.43485999999999991,0.37163000000003399,0.53180000000000005,0.76910000000000001,0.48332999999999998,0.570365000000017]
[null,null,null,null,null,null,null,null,null,null,null,216.70000000001201,0.48330000000000001,0.57023500000001703,0.43479999999999996,0.37137000000003406,0.53180000000000005,0.76910000000000001,0.48330000000000001,0.57023500000001703]
[null,null,null,null,null,null,null,null,null,null,null,216.80000000001201,0.48326999999999998,0.57010500000001707,0.4347399999999999,0.37111000000003413,0.53180000000000005,0.76910000000000001,0.48326999999999998,0.57010500000001707]
[null,null,null,null,null,null,null,null,null,null,null,216.900000000012,0.48324,0.56997500000001711,0.43467999999999996,0.37085000000003421,0.53180000000000005,0.76910000000000001,0.48324,0.56997500000001711]
[null,null,null,null,null,null,null,null,null,null,null,217.00000000001199,0.48320999999999997,0.56984500000001714,0.4346199999999999,0.37059000000003428,0.53180000000000005,0.76910000000000001,0.48320999999999997,0.56984500000001714]
[null,null,null,null,null,null,null,null,null,null,null,217.10000000001199,0.48318,0.56971500000001718,0.43455999999999995,0.37033000000003435,0.53180000000000005,0.76910000000000001,0.48318,0.56971500000001718]
[null,null,null,null,null,null,null,null,null,null,null,217.20000000001201,0.48315000000000002,0.56958500000001722,0.4345,0.37007000000003443,0.53180000000000005,0.76910000000000001,0.48315000000000002,0.56958500000001722]
[null,null,null,null,null,null,null,null,null,null,null,217.30000000001201,0.48311999999999999,0.56945500000001725,0.43443999999999994,0.3698100000000345,0.53180000000000005,0.76910000000000001,0.48311999999999999,0.56945500000001725]
[null,null,null,null,null,null,null,null,null,null,null,217.400000000012,0.48309000000000002,0.56932500000001729,0.43437999999999999,0.36955000000003457,0.53180000000000005,0.76910000000000001,0.48309000000000002,0.56932500000001729]
[null,null,null,null,null,null,null,null,null,null,null,217.50000000001199,0.48305999999999999,0.56919500000001733,0.43431999999999993,0.36929000000003465,0.53180000000000005,0.76910000000000001,0.48305999999999999,0.56919500000001733]
[null,null,null,null,null,null,null,null,null,null,null,217.60000000001199,0.48303000000000001,0.56906500000001736,0.43425999999999998,0.36903000000003472,0.53180000000000005,0.76910000000000001,0.48303000000000001,0.56906500000001736]
[null,null,null,null,null,null,null,null,null,null,null,217.70000000001201,0.48299999999999998,0.5689350000000174,0.43419999999999992,0.36877000000003479,0.53180000000000005,0.76910000000000001,0.48299999999999998,0.5689350000000174]
[null,null,null,null,null,null,null,null,null,null,null,217.80000000001201,0.48297000000000001,0.56880500000001744,0.43413999999999997,0.36851000000003487,0.53180000000000005,0.76910000000000001,0.48297000000000001,0.56880500000001744]
[null,null,null,null,null,null,null,null,null,null,null,217.900000000012,0.48293999999999998,0.56867500000001747,0.43407999999999991,0.36825000000003494,0.53180000000000005,0.76910000000000001,0.48293999999999998,0.56867500000001747]
[null,null,null,null,null,null,null,null,null,null,null,218.00000000001199,0.48291000000000001,0.56854500000001751,0.43401999999999996,0.36799000000003501,0.53180000000000005,0.76910000000000001,0.48291000000000001,0.56854500000001751]
[null,null,null,null,null,null,null,null,null,null,null,218.10000000001199,0.48287999999999998,0.56841500000001755,0.4339599999999999,0.36773000000003508,0.53180000000000005,0.76910000000000001,0.48287999999999998,0.56841500000001755]
[null,null,null,null,null,null,null,null,null,null,null,218.20000000001201,0.48285,0.56828500000001758,0.43389999999999995,0.36747000000003516,0.53180000000000005,0.76910000000000001,0.48285,0.56828500000001758]
[null,null,null,null,null,null,null,null,null,null,null,218.30000000001201,0.48282000000000003,0.56815500000001762,0.43384,0.36721000000003523,0.53180000000000005,0.76910000000000001,0.48282000000000003,0.56815500000001762]
[null,null,null,null,null,null,null,null,null,null,null,218.400000000012,0.48279,0.56802500000001765,0.43377999999999994,0.3669500000000353,0.53180000000000005,0.76910000000000001,0.48279,0.56802500000001765]
[null,null,null,null,null,null,null,null,null,null,null,218.50000000001199,0.48276000000000002,0.56789500000001769,0.43371999999999999,0.36669000000003538,0.53180000000000005,0.76910000000000001,0.48276000000000002,0.56789500000001769]
[null,null,null,null,null,null,null,null,null,null,null,218.60000000001199,0.48272999999999999,0.56776500000001773,0.43365999999999993,0.36643000000003545,0.53180000000000005,0.76910000000000001,0.48272999999999999,0.56776500000001773]
[null,null,null,null,null,null,null,null,null,null,null,218.70000000001201,0.48270000000000002,0.56763500000001776,0.43359999999999999,0.36617000000003552,0.53180000000000005,0.76910000000000001,0.48270000000000002,0.56763500000001776]
[null,null,null,null,null,null,null,null,null,null,null,218.80000000001201,0.48266999999999999,0.5675050000000178,0.43353999999999993,0.3659100000000356,0.53180000000000005,0.76910000000000001,0.48266999999999999,0.5675050000000178]
[null,null,null,null,null,null,null,null,null,null,null,218.900000000012,0.48264000000000001,0.56737500000001784,0.43347999999999998,0.36565000000003567,0.53180000000000005,0.76910000000000001,0.48264000000000001,0.56737500000001784]
[null,null,null,null,null,null,null,null,null,null,null,219.00000000001199,0.48260500000000001,0.56724500000001787,0.43340999999999996,0.36539000000003574,0.53180000000000005,0.76910000000000001,0.48260500000000001,0.56724500000001787]
[null,null,null,null,null,null,null,null,null,null,null,219.10000000001199,0.48257499999999998,0.56711500000001791,0.4333499999999999,0.36513000000003581,0.53180000000000005,0.76910000000000001,0.48257499999999998,0.56711500000001791]
[null,null,null,null,null,null,null,null,null,null,null,219.20000000001201,0.482545,0.56698500000001795,0.43328999999999995,0.36487000000003589,0.53180000000000005,0.76910000000000001,0.482545,0.56698500000001795]
[null,null,null,null,null,null,null,null,null,null,null,219.30000000001201,0.48251500000000003,0.56685500000001798,0.43323,0.36461000000003596,0.53180000000000005,0.76910000000000001,0.48251500000000003,0.56685500000001798]
[null,null,null,null,null,null,null,null,null,null,null,219.400000000012,0.482485,0.56672500000001802,0.43316999999999994,0.36435000000003603,0.53180000000000005,0.76910000000000001,0.482485,0.56672500000001802]
[null,null,null,null,null,null,null,null,null,null,null,219.50000000001199,0.48245500000000002,0.56659500000001806,0.43310999999999999,0.36409000000003611,0.53180000000000005,0.76910000000000001,0.48245500000000002,0.56659500000001806]
[null,null,null,null,null,null,null,null,null,null,null,219.60000000001199,0.48242499999999999,0.56646500000001809,0.43304999999999993,0.36383000000003618,0.53180000000000005,0.76910000000000001,0.48242499999999999,0.56646500000001809]
[null,null,null,null,null,null,null,null,null,null,null,219.70000000001201,0.48239500000000002,0.56633500000001813,0.43298999999999999,0.36357000000003625,0.53180000000000005,0.76910000000000001,0.48239500000000002,0.56633500000001813]
[null,null,null,null,null,null,null,null,null,null,null,219.80000000001201,0.48236499999999999,0.56620500000001817,0.43292999999999993,0.36331000000003633,0.53180000000000005,0.76910000000000001,0.48236499999999999,0.56620500000001817]
[null,null,null,null,null,null,null,null,null,null,null,219.900000000012,0.48233500000000001,0.5660750000000182,0.43286999999999998,0.3630500000000364,0.53180000000000005,0.76910000000000001,0.48233500000000001,0.5660750000000182]
[null,null,null,null,null,null,null,null,null,null,null,220.00000000001199,0.48230499999999998,0.56594500000001824,0.43280999999999992,0.36279000000003647,0.53180000000000005,0.76910000000000001,0.48230499999999998,0.56594500000001824]
[null,null,null,null,null,null,null,null,null,null,null,220.10000000001199,0.48227500000000001,0.56581500000001828,0.43274999999999997,0.36253000000003655,0.53180000000000005,0.76910000000000001,0.48227500000000001,0.56581500000001828]
[null,null,null,null,null,null,null,null,null,null,null,220.20000000001201,0.48224499999999998,0.56568500000001831,0.43268999999999991,0.36227000000003662,0.53180000000000005,0.76910000000000001,0.48224499999999998,0.56568500000001831]
[null,null,null,null,null,null,null,null,null,null,null,220.30000000001201,0.482215,0.56555500000001835,0.43262999999999996,0.36201000000003669,0.53180000000000005,0.76910000000000001,0.482215,0.56555500000001835]
[null,null,null,null,null,null,null,null,null,null,null,220.400000000012,0.48218499999999997,0.56542500000001839,0.4325699999999999,0.36175000000003676,0.53180000000000005,0.76910000000000001,0.48218499999999997,0.56542500000001839]
[null,null,null,null,null,null,null,null,null,null,null,220.50000000001299,0.482155,0.56529500000001842,0.43250999999999995,0.36149000000003684,0.53180000000000005,0.76910000000000001,0.482155,0.56529500000001842]
[null,null,null,null,null,null,null,null,null,null,null,220.60000000001199,0.48212500000000003,0.56516500000001846,0.43245,0.36123000000003691,0.53180000000000005,0.76910000000000001,0.48212500000000003,0.56516500000001846]
[null,null,null,null,null,null,null,null,null,null,null,220.70000000001201,0.482095,0.56503500000001849,0.43238999999999994,0.36097000000003698,0.53180000000000005,0.76910000000000001,0.482095,0.56503500000001849]
[null,null,null,null,null,null,null,null,null,null,null,220.80000000001201,0.48206500000000002,0.56490500000001853,0.43232999999999999,0.36071000000003706,0.53180000000000005,0.76910000000000001,0.48206500000000002,0.56490500000001853]
[null,null,null,null,null,null,null,null,null,null,null,220.90000000001299,0.48203499999999999,0.56477500000001857,0.43226999999999993,0.36045000000003713,0.53180000000000005,0.76910000000000001,0.48203499999999999,0.56477500000001857]
[null,null,null,null,null,null,null,null,null,null,null,221.00000000001299,0.48200500000000002,0.5646450000000186,0.43220999999999998,0.3601900000000372,0.53180000000000005,0.76910000000000001,0.48200500000000002,0.5646450000000186]
[null,null,null,null,null,null,null,null,null,null,null,221.10000000001301,0.48197499999999999,0.56451500000001864,0.43214999999999992,0.35993000000003728,0.53180000000000005,0.76910000000000001,0.48197499999999999,0.56451500000001864]
[null,null,null,null,null,null,null,null,null,null,null,221.20000000001301,0.48194500000000001,0.56438500000001868,0.43208999999999997,0.35967000000003735,0.53180000000000005,0.76910000000000001,0.48194500000000001,0.56438500000001868]
[null,null,null,null,null,null,null,null,null,null,null,221.300000000013,0.48191499999999998,0.56425500000001871,0.43202999999999991,0.35941000000003742,0.53180000000000005,0.76910000000000001,0.48191499999999998,0.56425500000001871]
[null,null,null,null,null,null,null,null,null,null,null,221.40000000001299,0.48188500000000001,0.56412500000001875,0.43196999999999997,0.35915000000003749,0.53180000000000005,0.76910000000000001,0.48188500000000001,0.56412500000001875]
[null,null,null,null,null,null,null,null,null,null,null,221.50000000001299,0.48185499999999998,0.56399500000001879,0.43190999999999991,0.35889000000003757,0.53180000000000005,0.76910000000000001,0.48185499999999998,0.56399500000001879]
[null,null,null,null,null,null,null,null,null,null,null,221.60000000001301,0.481825,0.56386500000001882,0.43184999999999996,0.35863000000003764,0.53180000000000005,0.76910000000000001,0.481825,0.56386500000001882]
[null,null,null,null,null,null,null,null,null,null,null,221.70000000001301,0.48179499999999997,0.56373500000001886,0.4317899999999999,0.35837000000003771,0.53180000000000005,0.76910000000000001,0.48179499999999997,0.56373500000001886]
[null,null,null,null,null,null,null,null,null,null,null,221.800000000013,0.481765,0.5636050000000189,0.43172999999999995,0.35811000000003779,0.53180000000000005,0.76910000000000001,0.481765,0.5636050000000189]
[null,null,null,null,null,null,null,null,null,null,null,221.90000000001299,0.48173500000000002,0.56347500000001893,0.43167,0.35785000000003786,0.53180000000000005,0.76910000000000001,0.48173500000000002,0.56347500000001893]
[null,null,null,null,null,null,null,null,null,null,null,222.00000000001299,0.48170499999999999,0.56334500000001897,0.43160999999999994,0.35759000000003793,0.53180000000000005,0.76910000000000001,0.48170499999999999,0.56334500000001897]
[null,null,null,null,null,null,null,null,null,null,null,222.10000000001301,0.48167500000000002,0.56321500000001901,0.43154999999999999,0.35733000000003801,0.53180000000000005,0.76910000000000001,0.48167500000000002,0.56321500000001901]
[null,null,null,null,null,null,null,null,null,null,null,222.20000000001301,0.48164499999999999,0.56308500000001904,0.43148999999999993,0.35707000000003808,0.53180000000000005,0.76910000000000001,0.48164499999999999,0.56308500000001904]
[null,null,null,null,null,null,null,null,null,null,null,222.300000000013,0.48161500000000002,0.56295500000001908,0.43142999999999998,0.35681000000003815,0.53180000000000005,0.76910000000000001,0.48161500000000002,0.56295500000001908]
[null,null,null,null,null,null,null,null,null,null,null,222.40000000001299,0.48158499999999999,0.56282500000001912,0.43136999999999992,0.35655000000003823,0.53180000000000005,0.76910000000000001,0.48158499999999999,0.56282500000001912]
[null,null,null,null,null,null,null,null,null,null,null,222.50000000001299,0.48155500000000001,0.56269500000001915,0.43130999999999997,0.3562900000000383,0.53180000000000005,0.76910000000000001,0.48155500000000001,0.56269500000001915]
[null,null,null,null,null,null,null,null,null,null,null,222.60000000001301,0.48152499999999998,0.56256500000001919,0.43125000000000002,0.35603000000003837,0.53180000000000005,0.76910000000000001,0.48152499999999998,0.56256500000001919]
[null,null,null,null,null,null,null,null,null,null,null,222.70000000001301,0.48149500000000001,0.56243500000001923,0.43118999999999996,0.35577000000003844,0.53180000000000005,0.76910000000000001,0.48149500000000001,0.56243500000001923]
[null,null,null,null,null,null,null,null,null,null,null,222.800000000013,0.48146499999999998,0.56230500000001926,0.4311299999999999,0.35551000000003852,0.53180000000000005,0.76910000000000001,0.48146499999999998,0.56230500000001926]
[null,null,null,null,null,null,null,null,null,null,null,222.90000000001299,0.481435,0.5621750000000193,0.43106999999999995,0.35525000000003859,0.53180000000000005,0.76910000000000001,0.481435,0.5621750000000193]
[null,null,null,null,null,null,null,null,null,null,null,223.00000000001299,0.48140500000000003,0.56204500000001933,0.43101,0.35499000000003866,0.53180000000000005,0.76910000000000001,0.48140500000000003,0.56204500000001933]
[null,null,null,null,null,null,null,null,null,null,null,223.10000000001301,0.481375,0.56191500000001937,0.43094999999999994,0.35473000000003874,0.53180000000000005,0.76910000000000001,0.481375,0.56191500000001937]
[null,null,null,null,null,null,null,null,null,null,null,223.20000000001301,0.48134500000000002,0.56178500000001941,0.43089,0.35447000000003881,0.53180000000000005,0.76910000000000001,0.48134500000000002,0.56178500000001941]
[null,null,null,null,null,null,null,null,null,null,null,223.300000000013,0.48131499999999999,0.56165500000001944,0.43082999999999994,0.35421000000003888,0.53180000000000005,0.76910000000000001,0.48131499999999999,0.56165500000001944]
[null,null,null,null,null,null,null,null,null,null,null,223.40000000001299,0.48128500000000002,0.56152500000001948,0.43076999999999999,0.35395000000003896,0.53180000000000005,0.76910000000000001,0.48128500000000002,0.56152500000001948]
[null,null,null,null,null,null,null,null,null,null,null,223.50000000001299,0.48125499999999999,0.56139500000001952,0.43070999999999993,0.35369000000003903,0.53180000000000005,0.76910000000000001,0.48125499999999999,0.56139500000001952]
[null,null,null,null,null,null,null,null,null,null,null,223.60000000001301,0.48122500000000001,0.56126500000001955,0.43064999999999998,0.3534300000000391,0.53180000000000005,0.76910000000000001,0.48122500000000001,0.56126500000001955]
[null,null,null,null,null,null,null,null,null,null,null,223.70000000001301,0.48119499999999998,0.56113500000001959,0.43058999999999992,0.35317000000003917,0.53180000000000005,0.76910000000000001,0.48119499999999998,0.56113500000001959]
[null,null,null,null,null,null,null,null,null,null,null,223.800000000013,0.48116500000000001,0.56100500000001963,0.43052999999999997,0.35291000000003925,0.53180000000000005,0.76910000000000001,0.48116500000000001,0.56100500000001963]
[null,null,null,null,null,null,null,null,null,null,null,223.90000000001299,0.48113499999999998,0.56087500000001966,0.43046999999999991,0.35265000000003932,0.53180000000000005,0.76910000000000001,0.48113499999999998,0.56087500000001966]
[null,null,null,null,null,null,null,null,null,null,null,224.00000000001299,0.481105,0.5607450000000197,0.43040999999999996,0.35239000000003939,0.53180000000000005,0.76910000000000001,0.481105,0.5607450000000197]
[null,null,null,null,null,null,null,null,null,null,null,224.10000000001301,0.48107499999999997,0.56061500000001974,0.4303499999999999,0.35213000000003947,0.53180000000000005,0.76910000000000001,0.48107499999999997,0.56061500000001974]
[null,null,null,null,null,null,null,null,null,null,null,224.20000000001301,0.481045,0.56048500000001977,0.43028999999999995,0.35187000000003954,0.53180000000000005,0.76910000000000001,0.481045,0.56048500000001977]
[null,null,null,null,null,null,null,null,null,null,null,224.300000000013,0.48101500000000003,0.56035500000001981,0.43023,0.35161000000003961,0.53180000000000005,0.76910000000000001,0.48101500000000003,0.56035500000001981]
[null,null,null,null,null,null,null,null,null,null,null,224.40000000001299,0.480985,0.56022500000001985,0.43016999999999994,0.35135000000003969,0.53180000000000005,0.76910000000000001,0.480985,0.56022500000001985]
[null,null,null,null,null,null,null,null,null,null,null,224.50000000001299,0.48095500000000002,0.56009500000001988,0.43010999999999999,0.35109000000003976,0.53180000000000005,0.76910000000000001,0.48095500000000002,0.56009500000001988]
[null,null,null,null,null,null,null,null,null,null,null,224.60000000001301,0.48092499999999999,0.55996500000001992,0.43004999999999993,0.35083000000003983,0.53180000000000005,0.76910000000000001,0.48092499999999999,0.55996500000001992]
[null,null,null,null,null,null,null,null,null,null,null,224.70000000001301,0.48088999999999998,0.55983500000001996,0.42997999999999992,0.35057000000003991,0.53180000000000005,0.76910000000000001,0.48088999999999998,0.55983500000001996]
[null,null,null,null,null,null,null,null,null,null,null,224.800000000013,0.48086000000000001,0.55970500000001999,0.42991999999999997,0.35031000000003998,0.53180000000000005,0.76910000000000001,0.48086000000000001,0.55970500000001999]
[null,null,null,null,null,null,null,null,null,null,null,224.90000000001399,0.48082999999999998,0.55957500000002003,0.42985999999999991,0.35005000000004005,0.53180000000000005,0.76910000000000001,0.48082999999999998,0.55957500000002003]
[null,null,null,null,null,null,null,null,null,null,null,225.00000000001299,0.48080499999999998,0.55944500000002007,0.42980999999999991,0.34979000000004012,0.53180000000000005,0.76910000000000001,0.48080499999999998,0.55944500000002007]
[null,null,null,null,null,null,null,null,null,null,null,225.10000000001301,0.48078500000000002,0.5593150000000201,0.42976999999999999,0.3495300000000402,0.53180000000000005,0.76910000000000001,0.48078500000000002,0.5593150000000201]
[null,null,null,null,null,null,null,null,null,null,null,225.20000000001301,0.480765,0.55918500000002014,0.42972999999999995,0.34927000000004027,0.53180000000000005,0.76910000000000001,0.480765,0.55918500000002014]
[null,null,null,null,null,null,null,null,null,null,null,225.30000000001399,0.48074499999999998,0.55905500000002017,0.42968999999999991,0.34901000000004034,0.53180000000000005,0.76910000000000001,0.48074499999999998,0.55905500000002017]
[null,null,null,null,null,null,null,null,null,null,null,225.40000000001399,0.48072500000000001,0.55892500000002021,0.42964999999999998,0.34875000000004042,0.53180000000000005,0.76910000000000001,0.48072500000000001,0.55892500000002021]
[null,null,null,null,null,null,null,null,null,null,null,225.50000000001401,0.48070499999999999,0.55879500000002025,0.42960999999999994,0.34849000000004049,0.53180000000000005,0.76910000000000001,0.48070499999999999,0.55879500000002025]
[null,null,null,null,null,null,null,null,null,null,null,225.60000000001401,0.48068499999999997,0.55866500000002028,0.4295699999999999,0.34823000000004056,0.53180000000000005,0.76910000000000001,0.48068499999999997,0.55866500000002028]
[null,null,null,null,null,null,null,null,null,null,null,225.700000000014,0.48066500000000001,0.55853500000002032,0.42952999999999997,0.34797000000004064,0.53180000000000005,0.76910000000000001,0.48066500000000001,0.55853500000002032]
[null,null,null,null,null,null,null,null,null,null,null,225.80000000001399,0.48064499999999999,0.55840500000002036,0.42948999999999993,0.34771000000004071,0.53180000000000005,0.76910000000000001,0.48064499999999999,0.55840500000002036]
[null,null,null,null,null,null,null,null,null,null,null,225.90000000001399,0.48062500000000002,0.55827500000002039,0.42945,0.34745000000004078,0.53180000000000005,0.76910000000000001,0.48062500000000002,0.55827500000002039]
[null,null,null,null,null,null,null,null,null,null,null,226.00000000001401,0.480605,0.55814500000002043,0.42940999999999996,0.34719000000004085,0.53180000000000005,0.76910000000000001,0.480605,0.55814500000002043]
[null,null,null,null,null,null,null,null,null,null,null,226.10000000001401,0.48058499999999998,0.55801500000002047,0.42936999999999992,0.34693000000004093,0.53180000000000005,0.76910000000000001,0.48058499999999998,0.55801500000002047]
[null,null,null,null,null,null,null,null,null,null,null,226.200000000014,0.48056500000000002,0.5578850000000205,0.42932999999999999,0.346670000000041,0.53180000000000005,0.76910000000000001,0.48056500000000002,0.5578850000000205]
[null,null,null,null,null,null,null,null,null,null,null,226.30000000001399,0.480545,0.55775500000002054,0.42928999999999995,0.34641000000004107,0.53180000000000005,0.76910000000000001,0.480545,0.55775500000002054]
[null,null,null,null,null,null,null,null,null,null,null,226.40000000001399,0.48052499999999998,0.55762500000002058,0.42924999999999991,0.34615000000004115,0.53180000000000005,0.76910000000000001,0.48052499999999998,0.55762500000002058]
[null,null,null,null,null,null,null,null,null,null,null,226.50000000001401,0.48050500000000002,0.55749500000002061,0.42920999999999998,0.34589000000004122,0.53180000000000005,0.76910000000000001,0.48050500000000002,0.55749500000002061]
[null,null,null,null,null,null,null,null,null,null,null,226.60000000001401,0.480485,0.55736500000002065,0.42916999999999994,0.34563000000004129,0.53180000000000005,0.76910000000000001,0.480485,0.55736500000002065]
[null,null,null,null,null,null,null,null,null,null,null,226.700000000014,0.48046499999999998,0.55723500000002069,0.4291299999999999,0.34537000000004137,0.53180000000000005,0.76910000000000001,0.48046499999999998,0.55723500000002069]
[null,null,null,null,null,null,null,null,null,null,null,226.80000000001399,0.48044500000000001,0.55710500000002072,0.42908999999999997,0.34511000000004144,0.53180000000000005,0.76910000000000001,0.48044500000000001,0.55710500000002072]
[null,null,null,null,null,null,null,null,null,null,null,226.90000000001399,0.48042499999999999,0.55697500000002076,0.42904999999999993,0.34485000000004151,0.53180000000000005,0.76910000000000001,0.48042499999999999,0.55697500000002076]
[null,null,null,null,null,null,null,null,null,null,null,227.00000000001401,0.48040500000000003,0.5568450000000208,0.42901,0.34459000000004159,0.53180000000000005,0.76910000000000001,0.48040500000000003,0.5568450000000208]
[null,null,null,null,null,null,null,null,null,null,null,227.10000000001401,0.48038500000000001,0.55671500000002083,0.42896999999999996,0.34433000000004166,0.53180000000000005,0.76910000000000001,0.48038500000000001,0.55671500000002083]
[null,null,null,null,null,null,null,null,null,null,null,227.200000000014,0.48036499999999999,0.55658500000002087,0.42892999999999992,0.34407000000004173,0.53180000000000005,0.76910000000000001,0.48036499999999999,0.55658500000002087]
[null,null,null,null,null,null,null,null,null,null,null,227.30000000001399,0.48034500000000002,0.55645500000002091,0.42888999999999999,0.3438100000000418,0.53180000000000005,0.76910000000000001,0.48034500000000002,0.55645500000002091]
[null,null,null,null,null,null,null,null,null,null,null,227.40000000001399,0.480325,0.55632500000002094,0.42884999999999995,0.34355000000004188,0.53180000000000005,0.76910000000000001,0.480325,0.55632500000002094]
[null,null,null,null,null,null,null,null,null,null,null,227.50000000001401,0.48030499999999998,0.55619500000002098,0.42880999999999991,0.34329000000004195,0.53180000000000005,0.76910000000000001,0.48030499999999998,0.55619500000002098]
[null,null,null,null,null,null,null,null,null,null,null,227.60000000001401,0.48028500000000002,0.55606500000002101,0.42876999999999998,0.34303000000004202,0.53180000000000005,0.76910000000000001,0.48028500000000002,0.55606500000002101]
[null,null,null,null,null,null,null,null,null,null,null,227.700000000014,0.480265,0.55593500000002105,0.42872999999999994,0.3427700000000421,0.53180000000000005,0.76910000000000001,0.480265,0.55593500000002105]
[null,null,null,null,null,null,null,null,null,null,null,227.80000000001399,0.48024499999999998,0.55580500000002109,0.4286899999999999,0.34251000000004217,0.53180000000000005,0.76910000000000001,0.48024499999999998,0.55580500000002109]
[null,null,null,null,null,null,null,null,null,null,null,227.90000000001399,0.48022500000000001,0.55567500000002112,0.42864999999999998,0.34225000000004224,0.53180000000000005,0.76910000000000001,0.48022500000000001,0.55567500000002112]
[null,null,null,null,null,null,null,null,null,null,null,228.00000000001401,0.48020499999999999,0.55554500000002116,0.42860999999999994,0.34199000000004232,0.53180000000000005,0.76910000000000001,0.48020499999999999,0.55554500000002116]
[null,null,null,null,null,null,null,null,null,null,null,228.10000000001401,0.48018499999999997,0.5554150000000212,0.4285699999999999,0.34173000000004239,0.53180000000000005,0.76910000000000001,0.48018499999999997,0.5554150000000212]
[null,null,null,null,null,null,null,null,null,null,null,228.200000000014,0.48016500000000001,0.55528500000002123,0.42852999999999997,0.34147000000004246,0.53180000000000005,0.76910000000000001,0.48016500000000001,0.55528500000002123]
[null,null,null,null,null,null,null,null,null,null,null,228.30000000001399,0.48014499999999999,0.55515500000002127,0.42848999999999993,0.34121000000004253,0.53180000000000005,0.76910000000000001,0.48014499999999999,0.55515500000002127]
[null,null,null,null,null,null,null,null,null,null,null,228.40000000001399,0.48012500000000002,0.55502500000002131,0.42845,0.34095000000004261,0.53180000000000005,0.76910000000000001,0.48012500000000002,0.55502500000002131]
[null,null,null,null,null,null,null,null,null,null,null,228.50000000001401,0.480105,0.55489500000002134,0.42840999999999996,0.34069000000004268,0.53180000000000005,0.76910000000000001,0.480105,0.55489500000002134]
[null,null,null,null,null,null,null,null,null,null,null,228.60000000001401,0.48008499999999998,0.55476500000002138,0.42836999999999992,0.34043000000004275,0.53180000000000005,0.76910000000000001,0.48008499999999998,0.55476500000002138]
[null,null,null,null,null,null,null,null,null,null,null,228.700000000014,0.48006500000000002,0.55463500000002142,0.42832999999999999,0.34017000000004283,0.53180000000000005,0.76910000000000001,0.48006500000000002,0.55463500000002142]
[null,null,null,null,null,null,null,null,null,null,null,228.80000000001399,0.480045,0.55450500000002145,0.42828999999999995,0.3399100000000429,0.53180000000000005,0.76910000000000001,0.480045,0.55450500000002145]
[null,null,null,null,null,null,null,null,null,null,null,228.90000000001399,0.48002499999999998,0.55437500000002149,0.42824999999999991,0.33965000000004297,0.53180000000000005,0.76910000000000001,0.48002499999999998,0.55437500000002149]
[null,null,null,null,null,null,null,null,null,null,null,229.00000000001401,0.48000500000000001,0.55424500000002153,0.42820999999999998,0.33939000000004305,0.53180000000000005,0.76910000000000001,0.48000500000000001,0.55424500000002153]
[null,null,null,null,null,null,null,null,null,null,null,229.10000000001401,0.47908499999999998,0.55411500000002156,0.42636999999999992,0.33913000000004312,0.53180000000000005,0.76910000000000001,0.47908499999999998,0.55411500000002156]
[null,null,null,null,null,null,null,null,null,null,null,229.200000000014,0.47906500000000002,0.5539850000000216,0.42632999999999999,0.33887000000004319,0.53180000000000005,0.76910000000000001,0.47906500000000002,0.5539850000000216]
[null,null,null,null,null,null,null,null,null,null,null,229.30000000001399,0.479045,0.55385500000002164,0.42628999999999995,0.33861000000004327,0.53180000000000005,0.76910000000000001,0.479045,0.55385500000002164]
[null,null,null,null,null,null,null,null,null,null,null,229.40000000001399,0.47902499999999998,0.55372500000002167,0.42625000000000002,0.33835000000004334,0.53180000000000005,0.76910000000000001,0.47902499999999998,0.55372500000002167]
[null,null,null,null,null,null,null,null,null,null,null,229.50000000001401,0.47900500000000001,0.55359500000002171,0.42620999999999998,0.33809000000004341,0.53180000000000005,0.76910000000000001,0.47900500000000001,0.55359500000002171]
[null,null,null,null,null,null,null,null,null,null,null,229.60000000001401,0.47898499999999999,0.55346500000002175,0.42616999999999994,0.33783000000004348,0.53180000000000005,0.76910000000000001,0.47898499999999999,0.55346500000002175]
[null,null,null,null,null,null,null,null,null,null,null,229.700000000015,0.47896499999999997,0.55333500000002178,0.4261299999999999,0.33757000000004356,0.53180000000000005,0.76910000000000001,0.47896499999999997,0.55333500000002178]
[null,null,null,null,null,null,null,null,null,null,null,229.80000000001499,0.47894500000000001,0.55320500000002182,0.42608999999999997,0.33731000000004363,0.53180000000000005,0.76910000000000001,0.47894500000000001,0.55320500000002182]
[null,null,null,null,null,null,null,null,null,null,null,229.90000000001501,0.47892499999999999,0.55307500000002185,0.42604999999999993,0.3370500000000437,0.53180000000000005,0.76910000000000001,0.47892499999999999,0.55307500000002185]
[null,null,null,null,null,null,null,null,null,null,null,230.00000000001501,0.47890500000000003,0.55294500000002189,0.42601,0.33679000000004378,0.53180000000000005,0.76910000000000001,0.47890500000000003,0.55294500000002189]
[null,null,null,null,null,null,null,null,null,null,null,230.100000000015,0.47888500000000001,0.55281500000002193,0.42596999999999996,0.33653000000004385,0.53180000000000005,0.76910000000000001,0.47888500000000001,0.55281500000002193]
[null,null,null,null,null,null,null,null,null,null,null,230.200000000015,0.47886499999999999,0.55268500000002196,0.42592999999999992,0.33627000000004392,0.53180000000000005,0.76910000000000001,0.47886499999999999,0.55268500000002196]
[null,null,null,null,null,null,null,null,null,null,null,230.30000000001499,0.47884500000000002,0.552555000000022,0.42588999999999999,0.336010000000044,0.53180000000000005,0.76910000000000001,0.47884500000000002,0.552555000000022]
[null,null,null,null,null,null,null,null,null,null,null,230.40000000001501,0.478825,0.55242500000002204,0.42584999999999995,0.33575000000004407,0.53180000000000005,0.76910000000000001,0.478825,0.55242500000002204]
[null,null,null,null,null,null,null,null,null,null,null,230.50000000001501,0.47880499999999998,0.55229500000002207,0.42580999999999991,0.33549000000004414,0.53180000000000005,0.76910000000000001,0.47880499999999998,0.55229500000002207]
[null,null,null,null,null,null,null,null,null,null,null,230.600000000015,0.47878500000000002,0.55216500000002211,0.42576999999999998,0.33523000000004421,0.53180000000000005,0.76910000000000001,0.47878500000000002,0.55216500000002211]
[null,null,null,null,null,null,null,null,null,null,null,230.700000000015,0.478765,0.55203500000002215,0.42572999999999994,0.33497000000004429,0.53180000000000005,0.76910000000000001,0.478765,0.55203500000002215]
[null,null,null,null,null,null,null,null,null,null,null,230.80000000001499,0.47874499999999998,0.55190500000002218,0.4256899999999999,0.33471000000004436,0.53180000000000005,0.76910000000000001,0.47874499999999998,0.55190500000002218]
[null,null,null,null,null,null,null,null,null,null,null,230.90000000001501,0.47872500000000001,0.55177500000002222,0.42564999999999997,0.33445000000004443,0.53180000000000005,0.76910000000000001,0.47872500000000001,0.55177500000002222]

{"sheet":"Push-Pull","index":11,"n_rows":0,"n_cols":0,"rows_kept":0,"cut":false,"hidden":false,"merged":[]}

{"sheet":"PrintSheet","index":12,"n_rows":2,"n_cols":35,"rows_kept":2,"cut":false,"hidden":false,"merged":[[0,3,0,34]]}
[null,null,{"$f":"Setup!K2","v":"Date"},{"$f":"Setup!C2","v":"Contest Name"}]
["Sort data","Flt B","Name","Age","Div",{"$f":"Lifting!F8","v":"BWt (Kg)"},{"$f":"Lifting!G8","v":"WtCls (Kg)"},{"$f":"Lifting!H8","v":"Glossbrenner"},"Lot #","RH Sq"," Squat  1"," Squat  2"," Squat  3"," Squat  4","Best Squat","RH BP","Bench 1","Bench 2","Bench 3","Bench  4","Best Bench","Sub Total","Deadlift 1","Deadlift 2","Deadlift 3","Deadlift 4","Best Deadlift",{"$f":"Lifting!AB8","v":"PL Total"},"Coeff Score","Age  & Coeff","Place code","Pl-Div-WtCl","Team Pts","Team","Events"]

{"sheet":"Awards","index":13,"n_rows":14,"n_cols":16,"rows_kept":14,"cut":false,"hidden":false,"merged":[[6,11,6,14],[5,9,5,14],[1,9,1,15]]}
[]
[null,null,null,null,null,null,null,null,null,{"$f":"Setup!C2","v":"Contest Name"}]
[null,null,null,null,null,null,null,null,null,null,null,"contest logo here"]
[]
["Abbrev","Division"]
[{"$f":"OFFSET(Setup!O6,MATCH(J6,INDIRECT(B6),0),0)","v":{"$error":"#N/A"}},{"$f":"CONCATENATE(\"Setup!P7:P\",COUNTA(Setup!O:O)+4)","v":"Setup!P7:P247"},null,null,null,null,null,null,null,"Female open"]
["WtCls",{"$f":"IF(LEFT(A6,1)=\"M\",\"Setup!K9:K23\",\"Setup!M9:M23\")","v":{"$error":"#N/A"}},null,null,null,null,null,null,null,181,{"$f":"IF(J7=\"SHW\",\"Class\",IF(Setup!K6=\"BWt (Kg)\",\"Kilo Class\",\"Pound Class\"))","v":"Kilo Class"},"PL Total"]
[]
[null,{"$f":"OFFSET(Setup!Q6,MATCH(J6,INDIRECT(B6),0),0)","v":{"$error":"#N/A"}},null,null,null,null,null,null,null,"Place","Name","Best Squat","Best Bench","Best Deadlift","PL Total",{"$f":"IF(B9=1,\"\",\"Coeff-Score\")","v":{"$error":"#N/A"}}]
[null,{"$f":"CONCATENATE(J10,\"-\",$A$6,IF($B$9=1,CONCATENATE(\"-\",IF($J$7=\"SHW\",$J$7,ROUND($J$7,1))),\"\"))","v":{"$error":"#N/A"}},null,null,null,null,null,null,null,1,{"$f":"IF(ISERROR(INDIRECT(CONCATENATE(\"Lifting!C\",MATCH(B10,Lifting!$AF:$AF,0)))),\"\",INDIRECT(CONCATENATE(\"Lifting!C\",MATCH(B10,Lifting!$AF:$AF,0))))","v":""},{"$f":"IF(OR($L$7=\"Best Bench\",$L$7=\"Best Deadlift\",$L$7=\"Push Pull Total\"),\"\",IF(K10=\"\",\"\",INDIRECT(CONCATENATE(\"Lifting!O\",MATCH(B10,Lifting!$AF:$AF,0)))))","v":""},{"$f":"IF(OR($L$7=\"Best Squat\",$L$7=\"Best Deadlift\"),\"\",IF(K10=\"\",\"\",INDIRECT(CONCATENATE(\"Lifting!U\",MATCH(B10,Lifting!$AF:$AF,0)))))","v":""},{"$f":"IF(OR($L$7=\"Best Bench\",$L$7=\"Best Squat\"),\"\",IF(K10=\"\",\"\",INDIRECT(CONCATENATE(\"Lifting!AA\",MATCH(B10,Lifting!$AF:$AF,0)))))","v":""},{"$f":"IF(OR($L$7=\"Best Bench\",$L$7=\"Best Deadlift\",$L$7=\"Best Deadlift\"),\"\",IF(K10=\"\",\"\",INDIRECT(CONCATENATE(\"Lifting!AB\",MATCH(B10,Lifting!$AF:$AF,0)))))","v":""},{"$f":"IF(OR($B$9=1,K10=\"\"),\"\",INDIRECT(CONCATENATE(CONCATENATE(\"Lifting!\",IF($B$9=2,\"AC\",\"AD\"),MATCH(B10,Lifting!$AF:$AF,0)))))","v":{"$error":"#N/A"}}]
[null,{"$f":"CONCATENATE(J11,\"-\",$A$6,IF($B$9=1,CONCATENATE(\"-\",IF($J$7=\"SHW\",$J$7,ROUND($J$7,1))),\"\"))","v":{"$error":"#N/A"}},null,null,null,null,null,null,null,2,{"$f":"IF(ISERROR(INDIRECT(CONCATENATE(\"Lifting!C\",MATCH(B11,Lifting!$AF:$AF,0)))),\"\",INDIRECT(CONCATENATE(\"Lifting!C\",MATCH(B11,Lifting!$AF:$AF,0))))","v":""},{"$f":"IF(OR($L$7=\"Best Bench\",$L$7=\"Best Deadlift\",$L$7=\"Push Pull Total\"),\"\",IF(K11=\"\",\"\",INDIRECT(CONCATENATE(\"Lifting!O\",MATCH(B11,Lifting!$AF:$AF,0)))))","v":""},{"$f":"IF(OR($L$7=\"Best Squat\",$L$7=\"Best Deadlift\"),\"\",IF(K11=\"\",\"\",INDIRECT(CONCATENATE(\"Lifting!U\",MATCH(B11,Lifting!$AF:$AF,0)))))","v":""},{"$f":"IF(OR($L$7=\"Best Bench\",$L$7=\"Best Squat\"),\"\",IF(K11=\"\",\"\",INDIRECT(CONCATENATE(\"Lifting!AA\",MATCH(B11,Lifting!$AF:$AF,0)))))","v":""},{"$f":"IF(OR($L$7=\"Best Bench\",$L$7=\"Best Deadlift\",$L$7=\"Best Deadlift\"),\"\",IF(K11=\"\",\"\",INDIRECT(CONCATENATE(\"Lifting!AB\",MATCH(B11,Lifting!$AF:$AF,0)))))","v":""},{"$f":"IF(OR($B$9=1,K11=\"\"),\"\",INDIRECT(CONCATENATE(CONCATENATE(\"Lifting!\",IF($B$9=2,\"AC\",\"AD\"),MATCH(B11,Lifting!$AF:$AF,0)))))","v":{"$error":"#N/A"}}]
[null,{"$f":"CONCATENATE(J12,\"-\",$A$6,IF($B$9=1,CONCATENATE(\"-\",IF($J$7=\"SHW\",$J$7,ROUND($J$7,1))),\"\"))","v":{"$error":"#N/A"}},null,null,null,null,null,null,null,3,{"$f":"IF(ISERROR(INDIRECT(CONCATENATE(\"Lifting!C\",MATCH(B12,Lifting!$AF:$AF,0)))),\"\",INDIRECT(CONCATENATE(\"Lifting!C\",MATCH(B12,Lifting!$AF:$AF,0))))","v":""},{"$f":"IF(OR($L$7=\"Best Bench\",$L$7=\"Best Deadlift\",$L$7=\"Push Pull Total\"),\"\",IF(K12=\"\",\"\",INDIRECT(CONCATENATE(\"Lifting!O\",MATCH(B12,Lifting!$AF:$AF,0)))))","v":""},{"$f":"IF(OR($L$7=\"Best Squat\",$L$7=\"Best Deadlift\"),\"\",IF(K12=\"\",\"\",INDIRECT(CONCATENATE(\"Lifting!U\",MATCH(B12,Lifting!$AF:$AF,0)))))","v":""},{"$f":"IF(OR($L$7=\"Best Bench\",$L$7=\"Best Squat\"),\"\",IF(K12=\"\",\"\",INDIRECT(CONCATENATE(\"Lifting!AA\",MATCH(B12,Lifting!$AF:$AF,0)))))","v":""},{"$f":"IF(OR($L$7=\"Best Bench\",$L$7=\"Best Deadlift\",$L$7=\"Best Deadlift\"),\"\",IF(K12=\"\",\"\",INDIRECT(CONCATENATE(\"Lifting!AB\",MATCH(B12,Lifting!$AF:$AF,0)))))","v":""},{"$f":"IF(OR($B$9=1,K12=\"\"),\"\",INDIRECT(CONCATENATE(CONCATENATE(\"Lifting!\",IF($B$9=2,\"AC\",\"AD\"),MATCH(B12,Lifting!$AF:$AF,0)))))","v":{"$error":"#N/A"}}]
[null,{"$f":"CONCATENATE(J13,\"-\",$A$6,IF($B$9=1,CONCATENATE(\"-\",IF($J$7=\"SHW\",$J$7,ROUND($J$7,1))),\"\"))","v":{"$error":"#N/A"}},null,null,null,null,null,null,null,4,{"$f":"IF(ISERROR(INDIRECT(CONCATENATE(\"Lifting!C\",MATCH(B13,Lifting!$AF:$AF,0)))),\"\",INDIRECT(CONCATENATE(\"Lifting!C\",MATCH(B13,Lifting!$AF:$AF,0))))","v":""},{"$f":"IF(OR($L$7=\"Best Bench\",$L$7=\"Best Deadlift\",$L$7=\"Push Pull Total\"),\"\",IF(K13=\"\",\"\",INDIRECT(CONCATENATE(\"Lifting!O\",MATCH(B13,Lifting!$AF:$AF,0)))))","v":""},{"$f":"IF(OR($L$7=\"Best Squat\",$L$7=\"Best Deadlift\"),\"\",IF(K13=\"\",\"\",INDIRECT(CONCATENATE(\"Lifting!U\",MATCH(B13,Lifting!$AF:$AF,0)))))","v":""},{"$f":"IF(OR($L$7=\"Best Bench\",$L$7=\"Best Squat\"),\"\",IF(K13=\"\",\"\",INDIRECT(CONCATENATE(\"Lifting!AA\",MATCH(B13,Lifting!$AF:$AF,0)))))","v":""},{"$f":"IF(OR($L$7=\"Best Bench\",$L$7=\"Best Deadlift\",$L$7=\"Best Deadlift\"),\"\",IF(K13=\"\",\"\",INDIRECT(CONCATENATE(\"Lifting!AB\",MATCH(B13,Lifting!$AF:$AF,0)))))","v":""},{"$f":"IF(OR($B$9=1,K13=\"\"),\"\",INDIRECT(CONCATENATE(CONCATENATE(\"Lifting!\",IF($B$9=2,\"AC\",\"AD\"),MATCH(B13,Lifting!$AF:$AF,0)))))","v":{"$error":"#N/A"}}]
[null,{"$f":"CONCATENATE(J14,\"-\",$A$6,IF($B$9=1,CONCATENATE(\"-\",IF($J$7=\"SHW\",$J$7,ROUND($J$7,1))),\"\"))","v":{"$error":"#N/A"}},null,null,null,null,null,null,null,5,{"$f":"IF(ISERROR(INDIRECT(CONCATENATE(\"Lifting!C\",MATCH(B14,Lifting!$AF:$AF,0)))),\"\",INDIRECT(CONCATENATE(\"Lifting!C\",MATCH(B14,Lifting!$AF:$AF,0))))","v":""},{"$f":"IF(OR($L$7=\"Best Bench\",$L$7=\"Best Deadlift\",$L$7=\"Push Pull Total\"),\"\",IF(K14=\"\",\"\",INDIRECT(CONCATENATE(\"Lifting!O\",MATCH(B14,Lifting!$AF:$AF,0)))))","v":""},{"$f":"IF(OR($L$7=\"Best Squat\",$L$7=\"Best Deadlift\"),\"\",IF(K14=\"\",\"\",INDIRECT(CONCATENATE(\"Lifting!U\",MATCH(B14,Lifting!$AF:$AF,0)))))","v":""},{"$f":"IF(OR($L$7=\"Best Bench\",$L$7=\"Best Squat\"),\"\",IF(K14=\"\",\"\",INDIRECT(CONCATENATE(\"Lifting!AA\",MATCH(B14,Lifting!$AF:$AF,0)))))","v":""},{"$f":"IF(OR($L$7=\"Best Bench\",$L$7=\"Best Deadlift\",$L$7=\"Best Deadlift\"),\"\",IF(K14=\"\",\"\",INDIRECT(CONCATENATE(\"Lifting!AB\",MATCH(B14,Lifting!$AF:$AF,0)))))","v":""},{"$f":"IF(OR($B$9=1,K14=\"\"),\"\",INDIRECT(CONCATENATE(CONCATENATE(\"Lifting!\",IF($B$9=2,\"AC\",\"AD\"),MATCH(B14,Lifting!$AF:$AF,0)))))","v":{"$error":"#N/A"}}]

{"sheet":"Please read","index":14,"n_rows":27,"n_cols":3,"rows_kept":27,"cut":false,"hidden":false,"merged":[[7,1,7,13],[8,1,8,13],[12,1,12,13],[9,1,9,13],[10,1,10,13],[11,1,11,13],[5,1,5,13],[6,1,6,13],[1,1,1,13],[2,1,2,13],[3,1,3,13],[4,1,4,13]]}
[]
[null,"This program is free."]
[null,"Anybody may use, copy or share it and it may be freely distributed."]
[null,"It is copyrighted because I wouldn't want sombody else to sell it."]
[]
[null,"All I ask, is if you use the program and you like it that you consider a contribution in my daughter's name to the Little Star Foundation."]
[null,"You can find them on the web at http://www.littlestar.org/"]
[]
[null,"In January 2002 we lost our 16 year old daughter - Liz Marksteiner - after a 16-month fight with cancer."]
[null,"She grew up around powerlifting and though Liz never had any desire to lift, she was so proud of my wife and me when we were competing."]
[null,"When she was old enough she almost always found a way to help out - if she were here she'd be running this program."]
[null,"The summer before her death she spent a magical week at the foundation's Silver Lining Ranch in the Colorado mountains she loved."]
[null,"The ranch is a retreat for kids with cancer and it meant so much to her and us."]
[]
[null,"Best of luck with the program."]
[]
[null,"Sincerely"]
[null,"Joe Marksteiner"]
[]
[null,"e-mail"]
[null,"home","steinmark@aol.com"]
[null,"work","joe.marksteiner@ae.ge.com"]
[]
[null,"phone"]
[null,"home","513-755-6878"]
[null,"work","513-552-2122"]
[null,"cell","513-477-0775"]

{"sheet":"Black & White load sheet","index":15,"n_rows":260,"n_cols":17,"rows_kept":260,"cut":false,"hidden":false,"merged":[]}
["Available",4,0,0,16,2,2,4,2,2,"Bar & Collars",{"$f":"K2+B2*B1+C2*C1+D2*D1+E2*E1+F2*F1+G2*G1+H2*H1+I2*I1+J2*J1","v":632.5}]
["Kilos",{"$f":"IF($A$2=\"Kilos\",50,110)","v":50},{"$f":"IF($A$2=\"Kilos\",45,100)","v":45},{"$f":"IF($A$2=\"Kilos\",25,55)","v":25},{"$f":"IF($A$2=\"Kilos\",20,45)","v":20},{"$f":"IF($A$2=\"Kilos\",15,35)","v":15},{"$f":"IF($A$2=\"Kilos\",10,25)","v":10},{"$f":"IF($A$2=\"Kilos\",5,10)","v":5},{"$f":"IF($A$2=\"Kilos\",2.5,5)","v":2.5},{"$f":"IF($A$2=\"Kilos\",1.25,2.5)","v":1.25},35,"Index",null,null,{"$f":"IF($A$2=\"Pounds\",P2,Q2)","v":20},45,20]
["Weight",null,null,null,null,null,null,null,null,null,null,null,"Wt w/o bar",null,{"$f":"IF($A$2=\"Pounds\",P3,Q3)","v":22.5},50,22.5]
[{"$f":"IF(M4+$K$2>$L$1,0,M4+$K$2)","v":35},{"$f":"IF(A4=0,0,MIN($B$1/2,INT(M4/(2*$B$2))))","v":0},{"$f":"IF(A4=0,0,MIN($C$1/2,INT(($M4-2*$B4*$B$2)/(2*$C$2))))","v":0},{"$f":"IF(A4=0,0,MIN($D$1/2,INT(($M4-2*$B4*$B$2-2*$C4*$C$2)/(2*$D$2))))","v":0},{"$f":"IF(A4=0,0,MIN($E$1/2,INT(($M4-2*$B4*$B$2-2*$C4*$C$2-2*$D4*$D$2)/(2*$E$2))))","v":0},{"$f":"IF(A4=0,0,MIN($F$1/2,INT(($M4-2*$B4*$B$2-2*$C4*$C$2-2*$D4*$D$2-2*$E4*$E$2)/(2*$F$2))))","v":0},{"$f":"IF(A4=0,0,MIN($G$1/2,INT(($M4-2*$B4*$B$2-2*$C4*$C$2-2*$D4*$D$2-2*$E4*$E$2-2*$F4*$F$2)/(2*$G$2))))","v":0},{"$f":"IF(A4=0,0,MIN($H$1/2,INT(($M4-2*$B4*$B$2-2*$C4*$C$2-2*$D4*$D$2-2*$E4*$E$2-2*$F4*$F$2-2*$G4*$G$2)/(2*$H$2))))","v":0},{"$f":"IF(A4=0,0,MIN($I$1/2,INT(($M4-2*$B4*$B$2-2*$C4*$C$2-2*$D4*$D$2-2*$E4*$E$2-2*$F4*$F$2-2*$G4*$G$2-2*$H4*$H$2)/(2*$I$2))))","v":0},{"$f":"IF(A4=0,0,MIN($J$1/2,INT(($M4-2*$B4*$B$2-2*$C4*$C$2-2*$D4*$D$2-2*$E4*$E$2-2*$F4*$F$2-2*$G4*$G$2-2*$H4*$H$2-2*$I4*$I$2)/(2*$J$2))))","v":0},null,0,0,{"$f":"IF($K$2+2*(B4*$B$2+C4*$C$2+D4*$D$2+E4*$E$2+F4*$F$2+G4*$G$2+H4*$H$2+I4*$I$2+J4*$J$2)=A4,\"\",\"Not enough weight for this load\")","v":""},{"$f":"IF($A$2=\"Pounds\",P4,Q4)","v":25},55,25]
[{"$f":"IF(M5+$K$2>$L$1,0,M5+$K$2)","v":37.5},{"$f":"IF(A5=0,0,MIN($B$1/2,INT(M5/(2*$B$2))))","v":0},{"$f":"IF(A5=0,0,MIN($C$1/2,INT(($M5-2*$B5*$B$2)/(2*$C$2))))","v":0},{"$f":"IF(A5=0,0,MIN($D$1/2,INT(($M5-2*$B5*$B$2-2*$C5*$C$2)/(2*$D$2))))","v":0},{"$f":"IF(A5=0,0,MIN($E$1/2,INT(($M5-2*$B5*$B$2-2*$C5*$C$2-2*$D5*$D$2)/(2*$E$2))))","v":0},{"$f":"IF(A5=0,0,MIN($F$1/2,INT(($M5-2*$B5*$B$2-2*$C5*$C$2-2*$D5*$D$2-2*$E5*$E$2)/(2*$F$2))))","v":0},{"$f":"IF(A5=0,0,MIN($G$1/2,INT(($M5-2*$B5*$B$2-2*$C5*$C$2-2*$D5*$D$2-2*$E5*$E$2-2*$F5*$F$2)/(2*$G$2))))","v":0},{"$f":"IF(A5=0,0,MIN($H$1/2,INT(($M5-2*$B5*$B$2-2*$C5*$C$2-2*$D5*$D$2-2*$E5*$E$2-2*$F5*$F$2-2*$G5*$G$2)/(2*$H$2))))","v":0},{"$f":"IF(A5=0,0,MIN($I$1/2,INT(($M5-2*$B5*$B$2-2*$C5*$C$2-2*$D5*$D$2-2*$E5*$E$2-2*$F5*$F$2-2*$G5*$G$2-2*$H5*$H$2)/(2*$I$2))))","v":0},{"$f":"IF(A5=0,0,MIN($J$1/2,INT(($M5-2*$B5*$B$2-2*$C5*$C$2-2*$D5*$D$2-2*$E5*$E$2-2*$F5*$F$2-2*$G5*$G$2-2*$H5*$H$2-2*$I5*$I$2)/(2*$J$2))))","v":1},null,1,{"$f":"IF($A$2=\"Pounds\",5*L5,2.5*L5)","v":2.5},null,{"$f":"IF($A$2=\"Pounds\",P5,Q5)","v":30},65,30]
[40,0,0,0,0,0,0,0,1,0,null,2,5,null,{"$f":"IF($A$2=\"Pounds\",P6,Q6)","v":32.5},70,32.5]
[42.5,0,0,0,0,0,0,0,1,1,null,3,7.5,null,35,75,35]
[45,0,0,0,0,0,0,1,0,0,null,4,10]
[47.5,0,0,0,0,0,0,1,0,1,null,5,12.5]
[50,0,0,0,0,0,0,1,1,0,null,6,15]
[52.5,0,0,0,0,0,0,1,1,1,null,7,17.5]
[55,0,0,0,0,0,1,0,0,0,null,8,20]
[57.5,0,0,0,0,0,1,0,0,1,null,{"$f":"L12+1","v":9},22.5]
[60,0,0,0,0,0,1,0,1,0,null,10,25]
[62.5,0,0,0,0,0,1,0,1,1,null,11,27.5]
[65,0,0,0,0,1,0,0,0,0,null,12,30]
[67.5,0,0,0,0,1,0,0,0,1,null,13,32.5]
[70,0,0,0,0,1,0,0,1,0,null,14,35]
[72.5,0,0,0,0,1,0,0,1,1,null,15,37.5]
[75,0,0,0,1,0,0,0,0,0,null,16,40]
[77.5,0,0,0,1,0,0,0,0,1,null,17,42.5]
[80,0,0,0,1,0,0,0,1,0,null,18,45]
[82.5,0,0,0,1,0,0,0,1,1,null,19,47.5]
[85,0,0,0,1,0,0,1,0,0,null,20,50]
[87.5,0,0,0,1,0,0,1,0,1,null,21,52.5]
[90,0,0,0,1,0,0,1,1,0,null,22,55]
[92.5,0,0,0,1,0,0,1,1,1,null,23,57.5]
[95,0,0,0,1,0,1,0,0,0,null,24,60]
[97.5,0,0,0,1,0,1,0,0,1,null,25,62.5]
[100,0,0,0,1,0,1,0,1,0,null,26,65]
[102.5,0,0,0,1,0,1,0,1,1,null,27,67.5]
[105,0,0,0,1,1,0,0,0,0,null,28,70]
[107.5,0,0,0,1,1,0,0,0,1,null,29,72.5]
[110,0,0,0,1,1,0,0,1,0,null,30,75]
[112.5,0,0,0,1,1,0,0,1,1,null,31,77.5]
[115,0,0,0,2,0,0,0,0,0,null,32,80]
[117.5,0,0,0,2,0,0,0,0,1,null,33,82.5]
[120,0,0,0,2,0,0,0,1,0,null,34,85]
[122.5,0,0,0,2,0,0,0,1,1,null,35,87.5]
[125,0,0,0,2,0,0,1,0,0,null,36,90]
[127.5,0,0,0,2,0,0,1,0,1,null,37,92.5]
[130,0,0,0,2,0,0,1,1,0,null,38,95]
[132.5,0,0,0,2,0,0,1,1,1,null,39,97.5]
[135,1,0,0,0,0,0,0,0,0,null,40,100]
[137.5,1,0,0,0,0,0,0,0,1,null,41,102.5]
[140,1,0,0,0,0,0,0,1,0,null,42,105]
[142.5,1,0,0,0,0,0,0,1,1,null,43,107.5]
[145,1,0,0,0,0,0,1,0,0,null,44,110]
[147.5,1,0,0,0,0,0,1,0,1,null,45,112.5]
[150,1,0,0,0,0,0,1,1,0,null,46,115]
[152.5,1,0,0,0,0,0,1,1,1,null,47,117.5]
[155,1,0,0,0,0,1,0,0,0,null,48,120]
[157.5,1,0,0,0,0,1,0,0,1,null,49,122.5]
[160,1,0,0,0,0,1,0,1,0,null,50,125]
[162.5,1,0,0,0,0,1,0,1,1,null,51,127.5]
[165,1,0,0,0,1,0,0,0,0,null,52,130]
[167.5,1,0,0,0,1,0,0,0,1,null,53,132.5]
[170,1,0,0,0,1,0,0,1,0,null,54,135]
[172.5,1,0,0,0,1,0,0,1,1,null,55,137.5]
[175,1,0,0,1,0,0,0,0,0,null,56,140]
[177.5,1,0,0,1,0,0,0,0,1,null,57,142.5]
[180,1,0,0,1,0,0,0,1,0,null,58,145]
[182.5,1,0,0,1,0,0,0,1,1,null,59,147.5]
[185,1,0,0,1,0,0,1,0,0,null,60,150]
[187.5,1,0,0,1,0,0,1,0,1,null,61,152.5]
[190,1,0,0,1,0,0,1,1,0,null,62,155]
[192.5,1,0,0,1,0,0,1,1,1,null,63,157.5]
[195,1,0,0,1,0,1,0,0,0,null,64,160]
[{"$f":"IF(M69+$K$2>$L$1,0,M69+$K$2)","v":197.5},{"$f":"IF(A69=0,0,MIN($B$1/2,INT(M69/(2*$B$2))))","v":1},{"$f":"IF(A69=0,0,MIN($C$1/2,INT(($M69-2*$B69*$B$2)/(2*$C$2))))","v":0},{"$f":"IF(A69=0,0,MIN($D$1/2,INT(($M69-2*$B69*$B$2-2*$C69*$C$2)/(2*$D$2))))","v":0},{"$f":"IF(A69=0,0,MIN($E$1/2,INT(($M69-2*$B69*$B$2-2*$C69*$C$2-2*$D69*$D$2)/(2*$E$2))))","v":1},{"$f":"IF(A69=0,0,MIN($F$1/2,INT(($M69-2*$B69*$B$2-2*$C69*$C$2-2*$D69*$D$2-2*$E69*$E$2)/(2*$F$2))))","v":0},{"$f":"IF(A69=0,0,MIN($G$1/2,INT(($M69-2*$B69*$B$2-2*$C69*$C$2-2*$D69*$D$2-2*$E69*$E$2-2*$F69*$F$2)/(2*$G$2))))","v":1},{"$f":"IF(A69=0,0,MIN($H$1/2,INT(($M69-2*$B69*$B$2-2*$C69*$C$2-2*$D69*$D$2-2*$E69*$E$2-2*$F69*$F$2-2*$G69*$G$2)/(2*$H$2))))","v":0},{"$f":"IF(A69=0,0,MIN($I$1/2,INT(($M69-2*$B69*$B$2-2*$C69*$C$2-2*$D69*$D$2-2*$E69*$E$2-2*$F69*$F$2-2*$G69*$G$2-2*$H69*$H$2)/(2*$I$2))))","v":0},{"$f":"IF(A69=0,0,MIN($J$1/2,INT(($M69-2*$B69*$B$2-2*$C69*$C$2-2*$D69*$D$2-2*$E69*$E$2-2*$F69*$F$2-2*$G69*$G$2-2*$H69*$H$2-2*$I69*$I$2)/(2*$J$2))))","v":1},null,65,{"$f":"IF($A$2=\"Pounds\",5*L69,2.5*L69)","v":162.5}]
[200,1,0,0,1,0,1,0,1,0,null,66,165]
[202.5,1,0,0,1,0,1,0,1,1,null,67,167.5]
[205,1,0,0,1,1,0,0,0,0,null,68,170]
[207.5,1,0,0,1,1,0,0,0,1,null,69,172.5]
[210,1,0,0,1,1,0,0,1,0,null,70,175]
[212.5,1,0,0,1,1,0,0,1,1,null,71,177.5]
[215,1,0,0,2,0,0,0,0,0,null,72,180]
[217.5,1,0,0,2,0,0,0,0,1,null,{"$f":"L76+1","v":73},182.5]
[220,1,0,0,2,0,0,0,1,0,null,74,185]
[222.5,1,0,0,2,0,0,0,1,1,null,75,187.5]
[225,1,0,0,2,0,0,1,0,0,null,76,190]
[227.5,1,0,0,2,0,0,1,0,1,null,77,192.5]
[230,1,0,0,2,0,0,1,1,0,null,78,195]
[232.5,1,0,0,2,0,0,1,1,1,null,79,197.5]
[235,2,0,0,0,0,0,0,0,0,null,80,200]
[237.5,2,0,0,0,0,0,0,0,1,null,81,202.5]
[240,2,0,0,0,0,0,0,1,0,null,82,205]
[242.5,2,0,0,0,0,0,0,1,1,null,83,207.5]
[245,2,0,0,0,0,0,1,0,0,null,84,210]
[247.5,2,0,0,0,0,0,1,0,1,null,85,212.5]
[250,2,0,0,0,0,0,1,1,0,null,86,215]
[252.5,2,0,0,0,0,0,1,1,1,null,87,217.5]
[255,2,0,0,0,0,1,0,0,0,null,88,220]
[257.5,2,0,0,0,0,1,0,0,1,null,89,222.5]
[260,2,0,0,0,0,1,0,1,0,null,90,225]
[262.5,2,0,0,0,0,1,0,1,1,null,91,227.5]
[265,2,0,0,0,1,0,0,0,0,null,92,230]
[267.5,2,0,0,0,1,0,0,0,1,null,93,232.5]
[270,2,0,0,0,1,0,0,1,0,null,94,235]
[272.5,2,0,0,0,1,0,0,1,1,null,95,237.5]
[275,2,0,0,1,0,0,0,0,0,null,96,240]
[277.5,2,0,0,1,0,0,0,0,1,null,97,242.5]
[280,2,0,0,1,0,0,0,1,0,null,98,245]
[282.5,2,0,0,1,0,0,0,1,1,null,99,247.5]
[285,2,0,0,1,0,0,1,0,0,null,100,250]
[287.5,2,0,0,1,0,0,1,0,1,null,101,252.5]
[290,2,0,0,1,0,0,1,1,0,null,102,255]
[292.5,2,0,0,1,0,0,1,1,1,null,103,257.5]
[295,2,0,0,1,0,1,0,0,0,null,104,260]
[297.5,2,0,0,1,0,1,0,0,1,null,105,262.5]
[300,2,0,0,1,0,1,0,1,0,null,106,265]
[302.5,2,0,0,1,0,1,0,1,1,null,107,267.5]
[305,2,0,0,1,1,0,0,0,0,null,108,270]
[307.5,2,0,0,1,1,0,0,0,1,null,109,272.5]
[310,2,0,0,1,1,0,0,1,0,null,110,275]
[312.5,2,0,0,1,1,0,0,1,1,null,111,277.5]
[315,2,0,0,2,0,0,0,0,0,null,112,280]
[317.5,2,0,0,2,0,0,0,0,1,null,113,282.5]
[320,2,0,0,2,0,0,0,1,0,null,114,285]
[322.5,2,0,0,2,0,0,0,1,1,null,115,287.5]
[325,2,0,0,2,0,0,1,0,0,null,116,290]
[327.5,2,0,0,2,0,0,1,0,1,null,117,292.5]
[330,2,0,0,2,0,0,1,1,0,null,118,295]
[332.5,2,0,0,2,0,0,1,1,1,null,119,297.5]
[335,2,0,0,2,0,1,0,0,0,null,120,300]
[337.5,2,0,0,2,0,1,0,0,1,null,121,302.5]
[340,2,0,0,2,0,1,0,1,0,null,122,305]
[342.5,2,0,0,2,0,1,0,1,1,null,123,307.5]
[345,2,0,0,2,1,0,0,0,0,null,124,310]
[347.5,2,0,0,2,1,0,0,0,1,null,125,312.5]
[350,2,0,0,2,1,0,0,1,0,null,126,315]
[352.5,2,0,0,2,1,0,0,1,1,null,127,317.5]
[355,2,0,0,3,0,0,0,0,0,null,128,320]
[{"$f":"IF(M133+$K$2>$L$1,0,M133+$K$2)","v":357.5},{"$f":"IF(A133=0,0,MIN($B$1/2,INT(M133/(2*$B$2))))","v":2},{"$f":"IF(A133=0,0,MIN($C$1/2,INT(($M133-2*$B133*$B$2)/(2*$C$2))))","v":0},{"$f":"IF(A133=0,0,MIN($D$1/2,INT(($M133-2*$B133*$B$2-2*$C133*$C$2)/(2*$D$2))))","v":0},{"$f":"IF(A133=0,0,MIN($E$1/2,INT(($M133-2*$B133*$B$2-2*$C133*$C$2-2*$D133*$D$2)/(2*$E$2))))","v":3},{"$f":"IF(A133=0,0,MIN($F$1/2,INT(($M133-2*$B133*$B$2-2*$C133*$C$2-2*$D133*$D$2-2*$E133*$E$2)/(2*$F$2))))","v":0},{"$f":"IF(A133=0,0,MIN($G$1/2,INT(($M133-2*$B133*$B$2-2*$C133*$C$2-2*$D133*$D$2-2*$E133*$E$2-2*$F133*$F$2)/(2*$G$2))))","v":0},{"$f":"IF(A133=0,0,MIN($H$1/2,INT(($M133-2*$B133*$B$2-2*$C133*$C$2-2*$D133*$D$2-2*$E133*$E$2-2*$F133*$F$2-2*$G133*$G$2)/(2*$H$2))))","v":0},{"$f":"IF(A133=0,0,MIN($I$1/2,INT(($M133-2*$B133*$B$2-2*$C133*$C$2-2*$D133*$D$2-2*$E133*$E$2-2*$F133*$F$2-2*$G133*$G$2-2*$H133*$H$2)/(2*$I$2))))","v":0},{"$f":"IF(A133=0,0,MIN($J$1/2,INT(($M133-2*$B133*$B$2-2*$C133*$C$2-2*$D133*$D$2-2*$E133*$E$2-2*$F133*$F$2-2*$G133*$G$2-2*$H133*$H$2-2*$I133*$I$2)/(2*$J$2))))","v":1},null,129,{"$f":"IF($A$2=\"Pounds\",5*L133,2.5*L133)","v":322.5}]
[360,2,0,0,3,0,0,0,1,0,null,130,325]
[362.5,2,0,0,3,0,0,0,1,1,null,131,327.5]
[365,2,0,0,3,0,0,1,0,0,null,132,330]
[367.5,2,0,0,3,0,0,1,0,1,null,133,332.5]
[370,2,0,0,3,0,0,1,1,0,null,134,335]
[372.5,2,0,0,3,0,0,1,1,1,null,135,337.5]
[375,2,0,0,3,0,1,0,0,0,null,136,340]
[377.5,2,0,0,3,0,1,0,0,1,null,{"$f":"L140+1","v":137},342.5]
[380,2,0,0,3,0,1,0,1,0,null,138,345]
[382.5,2,0,0,3,0,1,0,1,1,null,139,347.5]
[385,2,0,0,3,1,0,0,0,0,null,140,350]
[387.5,2,0,0,3,1,0,0,0,1,null,141,352.5]
[390,2,0,0,3,1,0,0,1,0,null,142,355]
[392.5,2,0,0,3,1,0,0,1,1,null,143,357.5]
[395,2,0,0,4,0,0,0,0,0,null,144,360]
[397.5,2,0,0,4,0,0,0,0,1,null,145,362.5]
[400,2,0,0,4,0,0,0,1,0,null,146,365]
[402.5,2,0,0,4,0,0,0,1,1,null,147,367.5]
[405,2,0,0,4,0,0,1,0,0,null,148,370]
[407.5,2,0,0,4,0,0,1,0,1,null,149,372.5]
[410,2,0,0,4,0,0,1,1,0,null,150,375]
[412.5,2,0,0,4,0,0,1,1,1,null,151,377.5]
[415,2,0,0,4,0,1,0,0,0,null,152,380]
[417.5,2,0,0,4,0,1,0,0,1,null,153,382.5]
[420,2,0,0,4,0,1,0,1,0,null,154,385]
[422.5,2,0,0,4,0,1,0,1,1,null,155,387.5]
[425,2,0,0,4,1,0,0,0,0,null,156,390]
[427.5,2,0,0,4,1,0,0,0,1,null,157,392.5]
[430,2,0,0,4,1,0,0,1,0,null,158,395]
[432.5,2,0,0,4,1,0,0,1,1,null,159,397.5]
[435,2,0,0,5,0,0,0,0,0,null,160,400]
[437.5,2,0,0,5,0,0,0,0,1,null,161,402.5]
[440,2,0,0,5,0,0,0,1,0,null,162,405]
[442.5,2,0,0,5,0,0,0,1,1,null,163,407.5]
[445,2,0,0,5,0,0,1,0,0,null,164,410]
[447.5,2,0,0,5,0,0,1,0,1,null,165,412.5]
[450,2,0,0,5,0,0,1,1,0,null,166,415]
[452.5,2,0,0,5,0,0,1,1,1,null,167,417.5]
[455,2,0,0,5,0,1,0,0,0,null,168,420]
[457.5,2,0,0,5,0,1,0,0,1,null,169,422.5]
[460,2,0,0,5,0,1,0,1,0,null,170,425]
[462.5,2,0,0,5,0,1,0,1,1,null,171,427.5]
[465,2,0,0,5,1,0,0,0,0,null,172,430]
[467.5,2,0,0,5,1,0,0,0,1,null,173,432.5]
[470,2,0,0,5,1,0,0,1,0,null,174,435]
[472.5,2,0,0,5,1,0,0,1,1,null,175,437.5]
[475,2,0,0,6,0,0,0,0,0,null,176,440]
[477.5,2,0,0,6,0,0,0,0,1,null,177,442.5]
[480,2,0,0,6,0,0,0,1,0,null,178,445]
[482.5,2,0,0,6,0,0,0,1,1,null,179,447.5]
[485,2,0,0,6,0,0,1,0,0,null,180,450]
[487.5,2,0,0,6,0,0,1,0,1,null,181,452.5]
[490,2,0,0,6,0,0,1,1,0,null,182,455]
[492.5,2,0,0,6,0,0,1,1,1,null,183,457.5]
[495,2,0,0,6,0,1,0,0,0,null,184,460]
[497.5,2,0,0,6,0,1,0,0,1,null,185,462.5]
[500,2,0,0,6,0,1,0,1,0,null,186,465]
[502.5,2,0,0,6,0,1,0,1,1,null,187,467.5]
[505,2,0,0,6,1,0,0,0,0,null,188,470]
[507.5,2,0,0,6,1,0,0,0,1,null,189,472.5]
[510,2,0,0,6,1,0,0,1,0,null,190,475]
[512.5,2,0,0,6,1,0,0,1,1,null,191,477.5]
[515,2,0,0,7,0,0,0,0,0,null,192,480]
[{"$f":"IF(M197+$K$2>$L$1,0,M197+$K$2)","v":517.5},{"$f":"IF(A197=0,0,MIN($B$1/2,INT(M197/(2*$B$2))))","v":2},{"$f":"IF(A197=0,0,MIN($C$1/2,INT(($M197-2*$B197*$B$2)/(2*$C$2))))","v":0},{"$f":"IF(A197=0,0,MIN($D$1/2,INT(($M197-2*$B197*$B$2-2*$C197*$C$2)/(2*$D$2))))","v":0},{"$f":"IF(A197=0,0,MIN($E$1/2,INT(($M197-2*$B197*$B$2-2*$C197*$C$2-2*$D197*$D$2)/(2*$E$2))))","v":7},{"$f":"IF(A197=0,0,MIN($F$1/2,INT(($M197-2*$B197*$B$2-2*$C197*$C$2-2*$D197*$D$2-2*$E197*$E$2)/(2*$F$2))))","v":0},{"$f":"IF(A197=0,0,MIN($G$1/2,INT(($M197-2*$B197*$B$2-2*$C197*$C$2-2*$D197*$D$2-2*$E197*$E$2-2*$F197*$F$2)/(2*$G$2))))","v":0},{"$f":"IF(A197=0,0,MIN($H$1/2,INT(($M197-2*$B197*$B$2-2*$C197*$C$2-2*$D197*$D$2-2*$E197*$E$2-2*$F197*$F$2-2*$G197*$G$2)/(2*$H$2))))","v":0},{"$f":"IF(A197=0,0,MIN($I$1/2,INT(($M197-2*$B197*$B$2-2*$C197*$C$2-2*$D197*$D$2-2*$E197*$E$2-2*$F197*$F$2-2*$G197*$G$2-2*$H197*$H$2)/(2*$I$2))))","v":0},{"$f":"IF(A197=0,0,MIN($J$1/2,INT(($M197-2*$B197*$B$2-2*$C197*$C$2-2*$D197*$D$2-2*$E197*$E$2-2*$F197*$F$2-2*$G197*$G$2-2*$H197*$H$2-2*$I197*$I$2)/(2*$J$2))))","v":1},null,193,{"$f":"IF($A$2=\"Pounds\",5*L197,2.5*L197)","v":482.5}]
[520,2,0,0,7,0,0,0,1,0,null,194,485]
[522.5,2,0,0,7,0,0,0,1,1,null,195,487.5]
[525,2,0,0,7,0,0,1,0,0,null,196,490]
[527.5,2,0,0,7,0,0,1,0,1,null,197,492.5]
[530,2,0,0,7,0,0,1,1,0,null,198,495]
[532.5,2,0,0,7,0,0,1,1,1,null,199,497.5]
[535,2,0,0,7,0,1,0,0,0,null,200,500]
[537.5,2,0,0,7,0,1,0,0,1,null,{"$f":"L204+1","v":201},502.5]
[540,2,0,0,7,0,1,0,1,0,null,202,505]
[542.5,2,0,0,7,0,1,0,1,1,null,203,507.5]
[545,2,0,0,7,1,0,0,0,0,null,204,510]
[547.5,2,0,0,7,1,0,0,0,1,null,205,512.5]
[550,2,0,0,7,1,0,0,1,0,null,206,515]
[552.5,2,0,0,7,1,0,0,1,1,null,207,517.5]
[555,2,0,0,8,0,0,0,0,0,null,208,520]
[557.5,2,0,0,8,0,0,0,0,1,null,209,522.5]
[560,2,0,0,8,0,0,0,1,0,null,210,525]
[562.5,2,0,0,8,0,0,0,1,1,null,211,527.5]
[565,2,0,0,8,0,0,1,0,0,null,212,530]
[567.5,2,0,0,8,0,0,1,0,1,null,213,532.5]
[570,2,0,0,8,0,0,1,1,0,null,214,535]
[572.5,2,0,0,8,0,0,1,1,1,null,215,537.5]
[575,2,0,0,8,0,1,0,0,0,null,216,540]
[577.5,2,0,0,8,0,1,0,0,1,null,217,542.5]
[580,2,0,0,8,0,1,0,1,0,null,218,545]
[582.5,2,0,0,8,0,1,0,1,1,null,219,547.5]
[585,2,0,0,8,1,0,0,0,0,null,220,550]
[587.5,2,0,0,8,1,0,0,0,1,null,221,552.5]
[590,2,0,0,8,1,0,0,1,0,null,222,555]
[592.5,2,0,0,8,1,0,0,1,1,null,223,557.5]
[595,2,0,0,8,1,0,1,0,0,null,224,560]
[597.5,2,0,0,8,1,0,1,0,1,null,225,562.5]
[600,2,0,0,8,1,0,1,1,0,null,226,565]
[602.5,2,0,0,8,1,0,1,1,1,null,227,567.5]
[605,2,0,0,8,1,1,0,0,0,null,228,570]
[607.5,2,0,0,8,1,1,0,0,1,null,229,572.5]
[610,2,0,0,8,1,1,0,1,0,null,230,575]
[612.5,2,0,0,8,1,1,0,1,1,null,231,577.5]
[615,2,0,0,8,1,1,1,0,0,null,232,580]
[617.5,2,0,0,8,1,1,1,0,1,null,233,582.5]
[620,2,0,0,8,1,1,1,1,0,null,234,585]
[622.5,2,0,0,8,1,1,1,1,1,null,235,587.5]
[625,2,0,0,8,1,1,2,0,0,null,236,590]
[627.5,2,0,0,8,1,1,2,0,1,null,237,592.5]
[630,2,0,0,8,1,1,2,1,0,null,238,595]
[632.5,2,0,0,8,1,1,2,1,1,null,239,597.5]
[0,0,0,0,0,0,0,0,0,0,null,240,600]
[0,0,0,0,0,0,0,0,0,0,null,241,602.5]
[0,0,0,0,0,0,0,0,0,0,null,242,605]
[0,0,0,0,0,0,0,0,0,0,null,243,607.5]
[0,0,0,0,0,0,0,0,0,0,null,244,610]
[0,0,0,0,0,0,0,0,0,0,null,245,612.5]
[0,0,0,0,0,0,0,0,0,0,null,246,615]
[0,0,0,0,0,0,0,0,0,0,null,247,617.5]
[0,0,0,0,0,0,0,0,0,0,null,248,620]
[0,0,0,0,0,0,0,0,0,0,null,249,622.5]
[0,0,0,0,0,0,0,0,0,0,null,250,625]
[0,0,0,0,0,0,0,0,0,0,null,251,627.5]
[0,0,0,0,0,0,0,0,0,0,null,252,630]
[0,0,0,0,0,0,0,0,0,0,null,253,632.5]
[0,0,0,0,0,0,0,0,0,0,null,254,635]
[0,0,0,0,0,0,0,0,0,0,null,255,637.5]
[0,0,0,0,0,0,0,0,0,0,null,256,640]